id_mutation,date_mutation,numero_disposition,nature_mutation,valeur_fonciere,adresse_numero,adresse_suffixe,adresse_nom_voie,adresse_code_voie,code_postal,code_commune,nom_commune,code_departement,ancien_code_commune,ancien_nom_commune,id_parcelle,ancien_id_parcelle,numero_volume,lot1_numero,lot1_surface_carrez,lot2_numero,lot2_surface_carrez,lot3_numero,lot3_surface_carrez,lot4_numero,lot4_surface_carrez,lot5_numero,lot5_surface_carrez,nombre_lots,code_type_local,type_local,surface_reelle_bati,nombre_pieces_principales,code_nature_culture,nature_culture,code_nature_culture_speciale,nature_culture_speciale,surface_terrain,longitude,latitude
2020-334087,2020-10-26,000001,Vente,152000,148,A,RUE DU MENHIR,0017,29550,29166,Ploéven,29,,,29166000ZC0387,,,,,,,,,,,,,0,1,Maison,70,4,S,sols,,,622,-4.228334,48.157491
2020-334087,2020-10-26,000001,Vente,152000,148,A,RUE DU MENHIR,0017,29550,29166,Ploéven,29,,,29166000ZC0387,,,,,,,,,,,,,0,3,Dépendance,,0,S,sols,,,622,-4.228334,48.157491
2020-334920,2020-10-29,000001,Vente,25000,146,,RUE DU MENHIR,0017,29550,29166,Ploéven,29,,,29166000ZC0395,,,,,,,,,,,,,0,1,Maison,62,5,S,sols,,,335,-4.228596,48.15723
2020-334920,2020-10-29,000001,Vente,25000,,,KERLAZIOU,B211,29550,29166,Ploéven,29,,,29166000ZC0499,,,,,,,,,,,,,0,,,,,P,prés,,,300,-4.228722,48.157097
2020-335690,2020-12-04,000001,Vente,130000,,,LE BOURG,B030,29550,29166,Ploéven,29,,,29166000ZC0356,,,,,,,,,,,,,0,,,,,T,terres,,,418,-4.232118,48.156912
2020-335690,2020-12-04,000001,Vente,130000,5031,,IMP DES AUBEPINES,0003,29550,29166,Ploéven,29,,,29166000ZC0357,,,,,,,,,,,,,0,1,Maison,71,3,S,sols,,,595,-4.232302,48.156719
2020-335742,2020-11-18,000001,Vente,3000,,,KERLAZIOU,B211,29550,29166,Ploéven,29,,,29166000ZD0091,,,,,,,,,,,,,0,,,,,VE,vergers,,,1740,-4.219188,48.162026
2020-335742,2020-11-18,000001,Vente,3000,,,GOLOPER,B048,29550,29166,Ploéven,29,,,29166000ZD0112,,,,,,,,,,,,,0,,,,,T,terres,,,2500,-4.218072,48.161503
2020-351226,2020-01-14,000001,Vente,21000,,,COATMEUR,B046,29550,29166,Ploéven,29,,,29166000ZH0020,,,,,,,,,,,,,0,,,,,T,terres,,,27180,-4.196161,48.164934
2020-351844,2020-04-18,000001,Vente,73000,,,COATMEUR,B046,29550,29166,Ploéven,29,,,29166000ZH0019,,,,,,,,,,,,,0,,,,,L,landes,,,47070,-4.197838,48.165962
2020-351844,2020-04-18,000001,Vente,73000,,,COATMEUR,B046,29550,29166,Ploéven,29,,,29166000ZH0019,,,,,,,,,,,,,0,,,,,L,landes,,,960,-4.197838,48.165962
2020-351844,2020-04-18,000001,Vente,73000,,,COATMEUR,B046,29550,29166,Ploéven,29,,,29166000ZH0019,,,,,,,,,,,,,0,,,,,L,landes,,,16600,-4.197838,48.165962
2020-351844,2020-04-18,000001,Vente,73000,,,COATMEUR,B046,29550,29166,Ploéven,29,,,29166000ZH0019,,,,,,,,,,,,,0,,,,,T,terres,,,4160,-4.197838,48.165962
2020-351844,2020-04-18,000001,Vente,73000,,,COATMEUR,B046,29550,29166,Ploéven,29,,,29166000ZH0019,,,,,,,,,,,,,0,,,,,T,terres,,,29890,-4.197838,48.165962
2020-351844,2020-04-18,000001,Vente,73000,,,COATMEUR,B046,29550,29166,Ploéven,29,,,29166000ZH0019,,,,,,,,,,,,,0,,,,,P,prés,,,860,-4.197838,48.165962
2020-351844,2020-04-18,000001,Vente,73000,,,COATMEUR,B046,29550,29166,Ploéven,29,,,29166000ZH0057,,,,,,,,,,,,,0,,,,,P,prés,,,34290,-4.190279,48.167084
2020-351844,2020-04-18,000001,Vente,73000,,,COATMEUR,B046,29550,29166,Ploéven,29,,,29166000ZH0128,,,,,,,,,,,,,0,,,,,T,terres,,,15112,-4.193436,48.164527
2020-351980,2020-05-27,000001,Vente,70000,62,,RUE DES PRIMEVERES,0021,29550,29166,Ploéven,29,,,29166000ZC0340,,,,,,,,,,,,,0,1,Maison,95,4,S,sols,,,184,-4.232373,48.159127
2020-351980,2020-05-27,000001,Vente,70000,62,,RUE DES PRIMEVERES,0021,29550,29166,Ploéven,29,,,29166000ZC0340,,,,,,,,,,,,,0,3,Dépendance,,0,S,sols,,,184,-4.232373,48.159127
2020-351980,2020-05-27,000001,Vente,70000,,,LE BOURG,B030,29550,29166,Ploéven,29,,,29166000ZC0341,,,,,,,,,,,,,0,,,,,T,terres,,,420,-4.232199,48.158985
2020-351980,2020-05-27,000001,Vente,70000,,,LE BOURG,B030,29550,29166,Ploéven,29,,,29166000ZC0342,,,,,,,,,,,,,0,,,,,S,sols,,,44,-4.232316,48.159016
2020-352146,2020-06-19,000001,Vente,142600,148,,RUE DU MENHIR,0017,29550,29166,Ploéven,29,,,29166000ZC0385,,,,,,,,,,,,,0,1,Maison,184,10,S,sols,,,658,-4.228036,48.157396
2020-352146,2020-06-19,000001,Vente,142600,148,,RUE DU MENHIR,0017,29550,29166,Ploéven,29,,,29166000ZC0385,,,,,,,,,,,,,0,3,Dépendance,,0,S,sols,,,658,-4.228036,48.157396
2020-352146,2020-06-19,000001,Vente,142600,,,PEN AR C HLUN,B282,29550,29166,Ploéven,29,,,29166000ZC0396,,,,,,,,,,,,,0,,,,,S,sols,,,46,-4.227947,48.157209
2020-352499,2020-07-17,000002,Echange,48000,1979,D,KERGONNEC,B141,29550,29166,Ploéven,29,,,29166000ZR0034,,,,,,,,,,,,,0,1,Maison,182,7,J,jardins,,,1880,-4.237765,48.16362
2020-352499,2020-07-17,000002,Echange,48000,1979,D,KERGONNEC,B141,29550,29166,Ploéven,29,,,29166000ZR0034,,,,,,,,,,,,,0,1,Maison,182,7,S,sols,,,1000,-4.237765,48.16362
2020-352499,2020-07-17,000002,Echange,48000,,,KERGONNEC HUELLA,B143,29550,29166,Ploéven,29,,,29166000ZR0039,,,,,,,,,,,,,0,,,,,S,sols,,,1660,-4.236982,48.16403
2020-352499,2020-07-17,000002,Echange,48000,,,KERGONNEC HUELLA,B143,29550,29166,Ploéven,29,,,29166000ZR0041,,,,,,,,,,,,,0,,,,,S,sols,,,398,-4.237021,48.164202
2020-352499,2020-07-17,000002,Echange,48000,55,,KERGONNEC IZELLA,B157,29550,29166,Ploéven,29,,,29166000ZR0042,,,,,,,,,,,,,0,1,Maison,149,6,S,sols,,,1096,-4.237787,48.164034
2020-352501,2020-07-24,000001,Vente,25000,21,,KERMERRIEN,B221,29550,29166,Ploéven,29,,,29166000ZB0059,,,,,,,,,,,,,0,3,Dépendance,,0,S,sols,,,382,-4.249464,48.156028
2020-352501,2020-07-24,000001,Vente,25000,21,,KERMERRIEN,B221,29550,29166,Ploéven,29,,,29166000ZB0059,,,,,,,,,,,,,0,1,Maison,35,1,S,sols,,,382,-4.249464,48.156028
2020-352563,2020-07-31,000001,Vente,195000,34,,RUE DES MOUETTES,0018,29550,29166,Ploéven,29,,,29166000ZC0567,,,,,,,,,,,,,0,,,,,S,sols,,,1,-4.237498,48.156873
2020-352563,2020-07-31,000001,Vente,195000,,,RUE DES MOUETTES,0018,29550,29166,Ploéven,29,,,29166000ZC0569,,,,,,,,,,,,,0,,,,,S,sols,,,8,-4.237526,48.156877
2020-352563,2020-07-31,000001,Vente,195000,,,RUE DES MOUETTES,0018,29550,29166,Ploéven,29,,,29166000ZC0571,,,,,,,,,,,,,0,,,,,S,sols,,,30,-4.237544,48.156905
2020-352563,2020-07-31,000001,Vente,195000,,,RUE DES MOUETTES,0018,29550,29166,Ploéven,29,,,29166000ZC0574,,,,,,,,,,,,,0,,,,,S,sols,,,60,-4.237559,48.156982
2020-352563,2020-07-31,000001,Vente,195000,10,,RUE DES MOUETTES,0018,29550,29166,Ploéven,29,,,29166000ZC0575,,,,,,,,,,,,,0,1,Maison,123,3,S,sols,,,970,-4.237633,48.157264
2020-352563,2020-07-31,000001,Vente,195000,10,,RUE DES MOUETTES,0018,29550,29166,Ploéven,29,,,29166000ZC0575,,,,,,,,,,,,,0,3,Dépendance,,0,S,sols,,,970,-4.237633,48.157264
2020-352570,2020-07-29,000001,Vente,17304.13,,,KERGONNEC IZELLA,B157,29550,29166,Ploéven,29,,,29166000ZC0535,,,,,,,,,,,,,0,,,,,T,terres,,,19537,-4.237873,48.161123
2020-352570,2020-07-29,000001,Vente,17304.13,,,KERGONNEC IZELLA,B157,29550,29166,Ploéven,29,,,29166000ZC0535,,,,,,,,,,,,,0,,,,,T,terres,,,19538,-4.237873,48.161123
2020-352574,2020-07-29,000001,Vente,201686.81,,,KERGONNEC,B141,29550,29166,Ploéven,29,,,29166000ZC0476,,,,,,,,,,,,,0,,,,,T,terres,,,3797,-4.238615,48.160417
2020-352574,2020-07-29,000001,Vente,201686.81,,,KERGONNEC,B141,29550,29166,Ploéven,29,,,29166000ZC0476,,,,,,,,,,,,,0,,,,,T,terres,,,3797,-4.238615,48.160417
2020-352574,2020-07-29,000001,Vente,201686.81,,,KERGONNEC,B141,29550,29166,Ploéven,29,,,29166000ZC0476,,,,,,,,,,,,,0,,,,,T,terres,,,3798,-4.238615,48.160417
2020-352574,2020-07-29,000001,Vente,201686.81,,,KERGONNEC,B141,29550,29166,Ploéven,29,,,29166000ZC0476,,,,,,,,,,,,,0,,,,,S,sols,,,7360,-4.238615,48.160417
2020-352656,2020-08-28,000001,Vente,18000,,,COATMEUR,B046,29550,29166,Ploéven,29,,,29166000ZH0044,,,,,,,,,,,,,0,,,,,T,terres,,,29792,-4.195905,48.163204
2020-352656,2020-08-28,000001,Vente,18000,,,COATMEUR,B046,29550,29166,Ploéven,29,,,29166000ZH0044,,,,,,,,,,,,,0,,,,,VE,vergers,,,1288,-4.195905,48.163204
2020-352716,2020-08-31,000002,Vente,104062.3,,,KERMANAC'H,B088,29550,29166,Ploéven,29,,,29166000ZH0033,,,,,,,,,,,,,0,,,,,T,terres,,,39020,-4.187345,48.162102
2020-352716,2020-08-31,000002,Vente,104062.3,,,KERMANAC'H,B088,29550,29166,Ploéven,29,,,29166000ZH0036,,,,,,,,,,,,,0,,,,,T,terres,,,17475,-4.189645,48.164251
2020-352716,2020-08-31,000002,Vente,104062.3,,,KERMANAC'H,B088,29550,29166,Ploéven,29,,,29166000ZH0036,,,,,,,,,,,,,0,,,,,T,terres,,,5825,-4.189645,48.164251
2020-352716,2020-08-31,000002,Vente,104062.3,,,COATMEUR,B046,29550,29166,Ploéven,29,,,29166000ZH0058,,,,,,,,,,,,,0,,,,,T,terres,,,40390,-4.191112,48.164991
2020-352816,2020-08-29,000001,Vente,120000,1978,H,GOLOPER,B048,29550,29166,Ploéven,29,,,29166000ZE0060,,,,,,,,,,,,,0,1,Maison,121,7,S,sols,,,1012,-4.216976,48.161942
2020-352816,2020-08-29,000001,Vente,120000,1978,H,GOLOPER,B048,29550,29166,Ploéven,29,,,29166000ZE0060,,,,,,,,,,,,,0,3,Dépendance,,0,S,sols,,,1012,-4.216976,48.161942
2020-352829,2020-09-04,000001,Vente,82096,,,KERMANAC'H,B088,29550,29166,Ploéven,29,,,29166000ZH0032,,,,,,,,,,,,,0,,,,,T,terres,,,15600,-4.185098,48.161939
2020-352829,2020-09-04,000001,Vente,82096,,,KERMANAC'H,B088,29550,29166,Ploéven,29,,,29166000ZH0034,,,,,,,,,,,,,0,,,,,T,terres,,,43720,-4.191351,48.162881
2020-352829,2020-09-04,000001,Vente,82096,,,GORE AN DREFF,B067,29550,29166,Ploéven,29,,,29166000ZL0029,,,,,,,,,,,,,0,,,,,T,terres,,,43300,-4.181337,48.160604
2020-352902,2020-08-31,000001,Vente,64252,,,COATMEUR,B046,29550,29166,Ploéven,29,,,29166000ZH0061,,,,,,,,,,,,,0,,,,,T,terres,,,8930,-4.18938,48.166388
2020-352902,2020-08-31,000001,Vente,64252,,,COATMEUR,B046,29550,29166,Ploéven,29,,,29166000ZH0061,,,,,,,,,,,,,0,,,,,P,prés,,,970,-4.18938,48.166388
2020-352902,2020-08-31,000001,Vente,64252,,,KERMANAC'H,B088,29550,29166,Ploéven,29,,,29166000ZH0137,,,,,,,,,,,,,0,,,,,T,terres,,,6975,-4.19034,48.16055
2020-352902,2020-08-31,000001,Vente,64252,,,KERMANAC'H,B088,29550,29166,Ploéven,29,,,29166000ZH0137,,,,,,,,,,,,,0,,,,,P,prés,,,3973,-4.19034,48.16055
2020-352902,2020-08-31,000001,Vente,64252,,,KERMANAC'H,B088,29550,29166,Ploéven,29,,,29166000ZH0137,,,,,,,,,,,,,0,,,,,T,terres,,,18874,-4.19034,48.16055
2020-352902,2020-08-31,000001,Vente,64252,,,GORE AN DREFF,B067,29550,29166,Ploéven,29,,,29166000ZL0028,,,,,,,,,,,,,0,,,,,T,terres,,,43710,-4.184148,48.160885
2020-352998,2020-09-28,000001,Vente,128342.05,,,COATMEUR,B046,29550,29166,Ploéven,29,,,29166000ZH0109,,,,,,,,,,,,,0,,,,,P,prés,,,37336,-4.194318,48.167208
2020-352998,2020-09-28,000001,Vente,128342.05,,,COATMEUR,B046,29550,29166,Ploéven,29,,,29166000ZH0109,,,,,,,,,,,,,0,,,,,T,terres,,,13303,-4.194318,48.167208
2020-352998,2020-09-28,000001,Vente,128342.05,,,COATMEUR,B046,29550,29166,Ploéven,29,,,29166000ZH0109,,,,,,,,,,,,,0,,,,,T,terres,,,21571,-4.194318,48.167208
2020-352998,2020-09-28,000001,Vente,128342.05,,,KERMANAC'H,B088,29550,29166,Ploéven,29,,,29166000ZH0113,,,,,,,,,,,,,0,,,,,T,terres,,,702,-4.188688,48.161527
2020-352998,2020-09-28,000001,Vente,128342.05,,,KERRIEN,B224,29550,29166,Ploéven,29,,,29166000ZL0002,,,,,,,,,,,,,0,,,,,AB,terrains a bâtir,CHEM,Chemin (non groupe),1030,-4.184048,48.164714
2020-352998,2020-09-28,000001,Vente,128342.05,,,GORE AN DREFF,B067,29550,29166,Ploéven,29,,,29166000ZL0003,,,,,,,,,,,,,0,,,,,T,terres,,,89432,-4.18256,48.165249
2020-352998,2020-09-28,000001,Vente,128342.05,,,GORE AN DREFF,B067,29550,29166,Ploéven,29,,,29166000ZL0003,,,,,,,,,,,,,0,,,,,L,landes,,,15743,-4.18256,48.165249
2020-352998,2020-09-28,000001,Vente,128342.05,,,GORE AN DREFF,B067,29550,29166,Ploéven,29,,,29166000ZL0003,,,,,,,,,,,,,0,,,,,BR,futaies résineuses,,,2275,-4.18256,48.165249
2020-352999,2020-08-29,000001,Vente,12000,,,KERGOULOUARN,B164,29550,29166,Ploéven,29,,,29166000ZE0061,,,,,,,,,,,,,0,,,,,P,prés,,,14368,-4.21657,48.162399
2020-352999,2020-08-29,000001,Vente,12000,,,KERGOULOUARN,B164,29550,29166,Ploéven,29,,,29166000ZE0061,,,,,,,,,,,,,0,,,,,P,prés,,,15080,-4.21657,48.162399
