id_mutation,date_mutation,numero_disposition,nature_mutation,valeur_fonciere,adresse_numero,adresse_suffixe,adresse_nom_voie,adresse_code_voie,code_postal,code_commune,nom_commune,code_departement,ancien_code_commune,ancien_nom_commune,id_parcelle,ancien_id_parcelle,numero_volume,lot1_numero,lot1_surface_carrez,lot2_numero,lot2_surface_carrez,lot3_numero,lot3_surface_carrez,lot4_numero,lot4_surface_carrez,lot5_numero,lot5_surface_carrez,nombre_lots,code_type_local,type_local,surface_reelle_bati,nombre_pieces_principales,code_nature_culture,nature_culture,code_nature_culture_speciale,nature_culture_speciale,surface_terrain,longitude,latitude
2020-333910,2020-10-01,000001,Vente,1000,,,LA GARE,B052,29640,29275,Scrignac,29,,,292750000O0860,,,,,,,,,,,,,0,,,,,S,sols,,,550,-3.704112,48.412874
2020-334259,2020-10-27,000001,Vente,60000,569,,GUERDEFAN,B073,29640,29275,Scrignac,29,,,292750000M0641,,,,,,,,,,,,,0,1,Maison,114,4,S,sols,,,1292,-3.661271,48.397989
2020-334259,2020-10-27,000001,Vente,60000,569,,GUERDEFAN,B073,29640,29275,Scrignac,29,,,292750000M0641,,,,,,,,,,,,,0,3,Dépendance,,0,S,sols,,,1292,-3.661271,48.397989
2020-334278,2020-10-26,000001,Vente,30000,,,RUE CALONNEC,0040,29640,29275,Scrignac,29,,,29275000AC0156,,,,,,,,,,,,,0,,,,,J,jardins,,,425,-3.676396,48.431482
2020-334278,2020-10-26,000001,Vente,30000,17,,RUE FRANCIS KERVOELEN,0098,29640,29275,Scrignac,29,,,29275000AC0162,,,,,,,,,,,,,0,1,Maison,86,3,S,sols,,,767,-3.67662,48.431457
2020-334301,2020-10-08,000001,Echange,3000,,,PEN AR GARRONT,B245,29640,29275,Scrignac,29,,,292750000E0063,,,,,,,,,,,,,0,,,,,T,terres,,,9450,-3.636596,48.453524
2020-334301,2020-10-08,000002,Echange,3000,,,PEN AR GARRONT,B245,29640,29275,Scrignac,29,,,292750000D0109,,,,,,,,,,,,,0,,,,,T,terres,,,6552,-3.63497,48.458978
2020-334301,2020-10-08,000002,Echange,3000,,,PEN AR GARRONT,B245,29640,29275,Scrignac,29,,,292750000D0120,,,,,,,,,,,,,0,,,,,T,terres,,,4997,-3.634285,48.456196
2020-334374,2020-10-27,000001,Vente,37000,,,GUERDEFAN,B073,29640,29275,Scrignac,29,,,292750000M0635,,,,,,,,,,,,,0,,,,,S,sols,,,613,-3.662089,48.397528
2020-334374,2020-10-27,000001,Vente,37000,,,GUERDEFAN,B073,29640,29275,Scrignac,29,,,292750000M0636,,,,,,,,,,,,,0,,,,,T,terres,,,3250,-3.662247,48.397814
2020-334374,2020-10-27,000001,Vente,37000,,,GUERDEFAN,B073,29640,29275,Scrignac,29,,,292750000M0636,,,,,,,,,,,,,0,,,,,S,sols,,,2135,-3.662247,48.397814
2020-334374,2020-10-27,000001,Vente,37000,,,GUERDEFAN,B073,29640,29275,Scrignac,29,,,292750000M0638,,,,,,,,,,,,,0,,,,,S,sols,,,250,-3.661848,48.398035
2020-334374,2020-10-27,000001,Vente,37000,,,GUERDEFAN,B073,29640,29275,Scrignac,29,,,292750000M0708,,,,,,,,,,,,,0,,,,,S,sols,,,157,-3.661765,48.397973
2020-334374,2020-10-27,000001,Vente,37000,,,GUERDEFAN,B073,29640,29275,Scrignac,29,,,292750000M0713,,,,,,,,,,,,,0,,,,,S,sols,,,691,-3.662956,48.397396
2020-334820,2020-10-29,000001,Vente,138500,,,KERALAIN,B091,29640,29275,Scrignac,29,,,292750000O0678,,,,,,,,,,,,,0,,,,,BT,taillis simples,,,2200,-3.700567,48.416643
2020-334820,2020-10-29,000001,Vente,138500,,,KERALAIN,B091,29640,29275,Scrignac,29,,,292750000O0678,,,,,,,,,,,,,0,,,,,L,landes,,,2200,-3.700567,48.416643
2020-334820,2020-10-29,000001,Vente,138500,,,KERBOULOU,B098,29640,29275,Scrignac,29,,,292750000O0679,,,,,,,,,,,,,0,,,,,L,landes,,,2020,-3.701087,48.41634
2020-334820,2020-10-29,000001,Vente,138500,,,KERBOULOU,B098,29640,29275,Scrignac,29,,,292750000O0679,,,,,,,,,,,,,0,,,,,BT,taillis simples,,,2020,-3.701087,48.41634
2020-334820,2020-10-29,000001,Vente,138500,,,KERBOULOU,B098,29640,29275,Scrignac,29,,,292750000O0680,,,,,,,,,,,,,0,,,,,BT,taillis simples,,,490,-3.701038,48.416199
2020-334820,2020-10-29,000001,Vente,138500,,,KERALAIN,B091,29640,29275,Scrignac,29,,,292750000O0799,,,,,,,,,,,,,0,,,,,L,landes,,,920,-3.701799,48.411796
2020-334820,2020-10-29,000001,Vente,138500,,,KERALAIN,B091,29640,29275,Scrignac,29,,,292750000O0800,,,,,,,,,,,,,0,,,,,T,terres,,,1040,-3.702605,48.412171
2020-334820,2020-10-29,000001,Vente,138500,,,KERALAIN,B091,29640,29275,Scrignac,29,,,292750000O0801,,,,,,,,,,,,,0,,,,,L,landes,,,950,-3.703087,48.412237
2020-334820,2020-10-29,000001,Vente,138500,,,LA GARE,B052,29640,29275,Scrignac,29,,,292750000O0802,,,,,,,,,,,,,0,,,,,S,sols,,,66,-3.703093,48.412087
2020-334820,2020-10-29,000001,Vente,138500,688,,LA GARE,B052,29640,29275,Scrignac,29,,,292750000O0803,,,,,,,,,,,,,0,1,Maison,158,6,S,sols,,,117,-3.703185,48.412352
2020-334820,2020-10-29,000001,Vente,138500,,,KERALAIN,B091,29640,29275,Scrignac,29,,,292750000O0812,,,,,,,,,,,,,0,,,,,BT,taillis simples,,,3840,-3.70236,48.413587
2020-334820,2020-10-29,000001,Vente,138500,,,KERALAIN,B091,29640,29275,Scrignac,29,,,292750000O0813,,,,,,,,,,,,,0,,,,,L,landes,,,3920,-3.701082,48.413543
2020-334820,2020-10-29,000001,Vente,138500,,,KERALAIN,B091,29640,29275,Scrignac,29,,,292750000O0824,,,,,,,,,,,,,0,,,,,BT,taillis simples,,,3770,-3.702862,48.415179
2020-334820,2020-10-29,000001,Vente,138500,,,KERALAIN,B091,29640,29275,Scrignac,29,,,292750000O0825,,,,,,,,,,,,,0,,,,,BT,taillis simples,,,10305,-3.703525,48.414412
2020-334820,2020-10-29,000001,Vente,138500,,,LA GARE,B052,29640,29275,Scrignac,29,,,292750000O0858,,,,,,,,,,,,,0,,,,,S,sols,,,460,-3.70347,48.412621
2020-334820,2020-10-29,000001,Vente,138500,,,LA GARE,B052,29640,29275,Scrignac,29,,,292750000O0859,,,,,,,,,,,,,0,,,,,P,prés,,,1200,-3.70357,48.412594
2020-334845,2020-11-06,000001,Vente,60000,299,A,KERSAUX,B147,29640,29275,Scrignac,29,,,292750000F0584,,,,,,,,,,,,,0,1,Maison,68,2,J,jardins,,,1580,-3.661426,48.445564
2020-334845,2020-11-06,000001,Vente,60000,299,A,KERSAUX,B147,29640,29275,Scrignac,29,,,292750000F0584,,,,,,,,,,,,,0,1,Maison,68,2,S,sols,,,1420,-3.661426,48.445564
2020-335044,2020-10-26,000001,Vente,112500,2,,RUE DE PARADIS,0225,29640,29275,Scrignac,29,,,29275000AB0242,,,,,,,,,,,,,0,1,Maison,114,4,J,jardins,,,973,-3.673649,48.434618
2020-335044,2020-10-26,000001,Vente,112500,2,,RUE DE PARADIS,0225,29640,29275,Scrignac,29,,,29275000AB0242,,,,,,,,,,,,,0,1,Maison,114,4,S,sols,,,840,-3.673649,48.434618
2020-335261,2020-10-28,000001,Vente,79000,,,KERMAREC,B135,29640,29275,Scrignac,29,,,292750000G0096,,,,,,,,,,,,,0,,,,,S,sols,,,573,-3.6376,48.431392
2020-335261,2020-10-28,000001,Vente,79000,,,KERMAREC,B135,29640,29275,Scrignac,29,,,292750000G0097,,,,,,,,,,,,,0,,,,,T,terres,,,107,-3.637719,48.431398
2020-335261,2020-10-28,000001,Vente,79000,369,,KERMAREC,B135,29640,29275,Scrignac,29,,,292750000G0653,,,,,,,,,,,,,0,3,Dépendance,,0,AG,terrains d'agrément,,,824,-3.637705,48.431752
2020-335261,2020-10-28,000001,Vente,79000,369,,KERMAREC,B135,29640,29275,Scrignac,29,,,292750000G0653,,,,,,,,,,,,,0,1,Maison,90,3,AG,terrains d'agrément,,,824,-3.637705,48.431752
2020-335261,2020-10-28,000001,Vente,79000,369,,KERMAREC,B135,29640,29275,Scrignac,29,,,292750000G0653,,,,,,,,,,,,,0,1,Maison,90,3,S,sols,,,900,-3.637705,48.431752
2020-335261,2020-10-28,000001,Vente,79000,369,,KERMAREC,B135,29640,29275,Scrignac,29,,,292750000G0653,,,,,,,,,,,,,0,3,Dépendance,,0,S,sols,,,900,-3.637705,48.431752
2020-335987,2020-11-24,000001,Vente,44000,305,,POULPRY,B270,29640,29275,Scrignac,29,,,292750000F0097,,,,,,,,,,,,,0,1,Maison,40,1,S,sols,,,723,-3.652206,48.450756
2020-336487,2020-12-12,000001,Vente,37000,14,,RUE ALBERT PERROT,0200,29640,29275,Scrignac,29,,,29275000AB0113,,,,,,,,,,,,,0,1,Maison,57,3,S,sols,,,82,-3.677391,48.433644
2020-336487,2020-12-12,000001,Vente,37000,30,,RUE ALBERT PERROT,0200,29640,29275,Scrignac,29,,,29275000AB0121,,,,,,,,,,,,,0,3,Dépendance,,0,S,sols,,,273,-3.676159,48.434181
2020-336494,2020-12-16,000001,Vente,3079.85,,,KERFOUNOUS BRAS,B108,29640,29275,Scrignac,29,,,292750000M0117,,,,,,,,,,,,,0,,,,,T,terres,,,5938,-3.66394,48.411314
2020-336494,2020-12-16,000001,Vente,3079.85,,,KERFOUNOUS BRAS,B108,29640,29275,Scrignac,29,,,292750000M0136,,,,,,,,,,,,,0,,,,,BR,futaies résineuses,,,11500,-3.669608,48.407443
2020-336494,2020-12-16,000001,Vente,3079.85,,,KERFOUNOUS BRAS,B108,29640,29275,Scrignac,29,,,292750000M0141,,,,,,,,,,,,,0,,,,,BT,taillis simples,,,910,-3.671295,48.405785
2020-336494,2020-12-16,000001,Vente,3079.85,,,KERFOUNOUS BRAS,B108,29640,29275,Scrignac,29,,,292750000M0142,,,,,,,,,,,,,0,,,,,BT,taillis simples,,,431,-3.671102,48.406169
2020-336494,2020-12-16,000001,Vente,3079.85,,,KERFOUNOUS BRAS,B108,29640,29275,Scrignac,29,,,292750000M0143,,,,,,,,,,,,,0,,,,,P,prés,,,2110,-3.671697,48.40618
2020-336494,2020-12-16,000001,Vente,3079.85,,,KERFOUNOUS BRAS,B108,29640,29275,Scrignac,29,,,292750000M0147,,,,,,,,,,,,,0,,,,,BT,taillis simples,,,5400,-3.669837,48.407812
2020-336494,2020-12-16,000001,Vente,3079.85,,,KERFOUNOUS BRAS,B108,29640,29275,Scrignac,29,,,292750000M0267,,,,,,,,,,,,,0,,,,,L,landes,,,490,-3.671782,48.405947
2020-336494,2020-12-16,000001,Vente,3079.85,,,KERFOUNOUS BRAS,B108,29640,29275,Scrignac,29,,,292750000M0268,,,,,,,,,,,,,0,,,,,L,landes,,,780,-3.671547,48.405881
2020-336635,2020-12-17,000001,Vente,300,,,RUE DE PARADIS,0225,29640,29275,Scrignac,29,,,29275000AB0285,,,,,,,,,,,,,0,,,,,J,jardins,,,234,-3.67366,48.435586
2020-336644,2020-12-17,000001,Vente,35000,8,,RTE DE KERNEVEZ,0125,29640,29275,Scrignac,29,,,29275000AB0021,,,,,,,,,,,,,0,1,Maison,44,1,S,sols,,,64,-3.676759,48.435115
2020-336644,2020-12-17,000001,Vente,35000,,,RTE DE KERNEVEZ,0125,29640,29275,Scrignac,29,,,29275000AB0087,,,,,,,,,,,,,0,,,,,J,jardins,,,18,-3.676676,48.435054
2020-336669,2020-12-18,000001,Vente,80000,2,,RUE DU 19 MARS 1962,0067,29640,29275,Scrignac,29,,,292750000C0426,,,,,,,,,,,,,0,1,Maison,80,3,S,sols,,,1239,-3.672252,48.436853
2020-337090,2020-12-22,000001,Vente,5900,,,LEARS,B179,29640,29275,Scrignac,29,,,292750000H0139,,,,,,,,,,,,,0,,,,,T,terres,,,11529,-3.652714,48.419322
2020-337090,2020-12-22,000001,Vente,5900,,,LEARS,B179,29640,29275,Scrignac,29,,,292750000H0572,,,,,,,,,,,,,0,,,,,T,terres,,,2520,-3.649196,48.416573
2020-337090,2020-12-22,000001,Vente,5900,,,LEARS,B179,29640,29275,Scrignac,29,,,292750000H0573,,,,,,,,,,,,,0,,,,,S,sols,,,379,-3.650224,48.416475
2020-337090,2020-12-22,000001,Vente,5900,,,LEARS,B179,29640,29275,Scrignac,29,,,292750000H0577,,,,,,,,,,,,,0,,,,,T,terres,,,190,-3.65025,48.416284
2020-337093,2020-12-24,000001,Vente,20000,25,,RUE ALBERT PERROT,0200,29640,29275,Scrignac,29,,,29275000AB0081,,,,,,,,,,,,,0,1,Maison,71,2,S,sols,,,350,-3.675487,48.43494
2020-351199,2020-01-07,000001,Vente,8000,,,KERALAIN,B091,29640,29275,Scrignac,29,,,292750000O0715,,,,,,,,,,,,,0,,,,,T,terres,,,8300,-3.693076,48.414416
2020-351199,2020-01-07,000001,Vente,8000,,,KERALAIN,B091,29640,29275,Scrignac,29,,,292750000O0718,,,,,,,,,,,,,0,,,,,BT,taillis simples,,,240,-3.691173,48.415503
2020-351199,2020-01-07,000001,Vente,8000,,,KERALAIN,B091,29640,29275,Scrignac,29,,,292750000O0747,,,,,,,,,,,,,0,,,,,T,terres,,,3780,-3.693919,48.412775
2020-351199,2020-01-07,000001,Vente,8000,,,KERALAIN,B091,29640,29275,Scrignac,29,,,292750000O0749,,,,,,,,,,,,,0,,,,,BT,taillis simples,,,1240,-3.693846,48.412214
2020-351199,2020-01-07,000001,Vente,8000,,,KERALAIN,B091,29640,29275,Scrignac,29,,,292750000O0750,,,,,,,,,,,,,0,,,,,L,landes,,,2380,-3.693642,48.412036
2020-351199,2020-01-07,000001,Vente,8000,,,KERALAIN,B091,29640,29275,Scrignac,29,,,292750000O0756,,,,,,,,,,,,,0,,,,,T,terres,,,13660,-3.694398,48.410093
2020-351199,2020-01-07,000001,Vente,8000,,,KERALAIN,B091,29640,29275,Scrignac,29,,,292750000O0759,,,,,,,,,,,,,0,,,,,BT,taillis simples,,,1790,-3.693818,48.410855
2020-351199,2020-01-07,000001,Vente,8000,,,KERALAIN,B091,29640,29275,Scrignac,29,,,292750000O0761,,,,,,,,,,,,,0,,,,,L,landes,,,680,-3.693846,48.411563
2020-351199,2020-01-07,000001,Vente,8000,,,KERALAIN,B091,29640,29275,Scrignac,29,,,292750000O0762,,,,,,,,,,,,,0,,,,,BT,taillis simples,,,380,-3.693913,48.411768
2020-351199,2020-01-07,000001,Vente,8000,,,KERALAIN,B091,29640,29275,Scrignac,29,,,292750000O0766,,,,,,,,,,,,,0,,,,,T,terres,,,8006,-3.695094,48.412469
2020-351199,2020-01-07,000001,Vente,8000,,,KERALAIN,B091,29640,29275,Scrignac,29,,,292750000O0767,,,,,,,,,,,,,0,,,,,T,terres,,,734,-3.696056,48.412334
2020-351217,2020-01-14,000001,Vente,43800,,,KERVOEL,B166,29640,29275,Scrignac,29,,,292750000D0500,,,,,,,,,,,,,0,,,,,L,landes,,,1842,-3.628442,48.445569
2020-351217,2020-01-14,000001,Vente,43800,,,KERVOEL,B166,29640,29275,Scrignac,29,,,292750000D0505,,,,,,,,,,,,,0,,,,,T,terres,,,5661,-3.628129,48.445178
2020-351217,2020-01-14,000001,Vente,43800,,,KERVOEL,B166,29640,29275,Scrignac,29,,,292750000D0505,,,,,,,,,,,,,0,,,,,S,sols,,,4339,-3.628129,48.445178
2020-351217,2020-01-14,000001,Vente,43800,,,GUETEL,B083,29640,29275,Scrignac,29,,,292750000E0725,,,,,,,,,,,,,0,,,,,S,sols,,,100,-3.629402,48.440662
2020-351217,2020-01-14,000001,Vente,43800,,,GUETEL,B083,29640,29275,Scrignac,29,,,292750000E0725,,,,,,,,,,,,,0,,,,,T,terres,,,7940,-3.629402,48.440662
2020-351217,2020-01-14,000001,Vente,43800,,,GUETEL,B083,29640,29275,Scrignac,29,,,292750000E0742,,,,,,,,,,,,,0,,,,,S,sols,,,2450,-3.628613,48.440287
2020-351217,2020-01-14,000001,Vente,43800,,,GUETEL,B083,29640,29275,Scrignac,29,,,292750000E0742,,,,,,,,,,,,,0,,,,,T,terres,,,18220,-3.628613,48.440287
2020-351217,2020-01-14,000001,Vente,43800,,,GUETEL,B083,29640,29275,Scrignac,29,,,292750000E0743,,,,,,,,,,,,,0,,,,,S,sols,,,1150,-3.628476,48.440873
2020-351217,2020-01-14,000001,Vente,43800,357,,GUETEL,B083,29640,29275,Scrignac,29,,,292750000E0744,,,,,,,,,,,,,0,1,Maison,105,4,S,sols,,,480,-3.628779,48.441107
2020-351217,2020-01-14,000001,Vente,43800,,,GUETEL,B083,29640,29275,Scrignac,29,,,292750000E0745,,,,,,,,,,,,,0,,,,,S,sols,,,510,-3.628467,48.441186
2020-351217,2020-01-14,000001,Vente,43800,,,GUETEL,B083,29640,29275,Scrignac,29,,,292750000E0746,,,,,,,,,,,,,0,,,,,L,landes,,,780,-3.62839,48.441384
2020-351217,2020-01-14,000001,Vente,43800,,,GUETEL,B083,29640,29275,Scrignac,29,,,292750000E0747,,,,,,,,,,,,,0,,,,,T,terres,,,2305,-3.628095,48.44108
2020-351217,2020-01-14,000001,Vente,43800,,,GUETEL,B083,29640,29275,Scrignac,29,,,292750000E0747,,,,,,,,,,,,,0,,,,,S,sols,,,1575,-3.628095,48.44108
2020-351218,2020-01-14,000002,Vente,100,,,KERVOEL,B166,29640,29275,Scrignac,29,,,292750000D0500,,,,,,,,,,,,,0,,,,,L,landes,,,1842,-3.628442,48.445569
2020-351218,2020-01-14,000002,Vente,100,,,KERVOEL,B166,29640,29275,Scrignac,29,,,292750000D0505,,,,,,,,,,,,,0,,,,,S,sols,,,4339,-3.628129,48.445178
2020-351218,2020-01-14,000002,Vente,100,,,KERVOEL,B166,29640,29275,Scrignac,29,,,292750000D0505,,,,,,,,,,,,,0,,,,,T,terres,,,5661,-3.628129,48.445178
2020-351356,2020-01-24,000001,Vente,1786.4,,,KERMARZIN,B138,29640,29275,Scrignac,29,,,292750000A0399,,,,,,,,,,,,,0,,,,,BR,futaies résineuses,,,5140,-3.739857,48.44698
2020-351356,2020-01-24,000001,Vente,1786.4,,,KERMARZIN,B138,29640,29275,Scrignac,29,,,292750000A0452,,,,,,,,,,,,,0,,,,,BR,futaies résineuses,,,3300,-3.73878,48.440358
2020-351356,2020-01-24,000001,Vente,1786.4,,,KERMARZIN,B138,29640,29275,Scrignac,29,,,292750000A0453,,,,,,,,,,,,,0,,,,,BR,futaies résineuses,,,2340,-3.737859,48.440342
2020-351356,2020-01-24,000001,Vente,1786.4,,,KERMARZIN,B138,29640,29275,Scrignac,29,,,292750000A0454,,,,,,,,,,,,,0,,,,,L,landes,,,1520,-3.73817,48.440043
2020-351356,2020-01-24,000001,Vente,1786.4,,,KERMARZIN,B138,29640,29275,Scrignac,29,,,292750000A0457,,,,,,,,,,,,,0,,,,,BR,futaies résineuses,,,3480,-3.737716,48.439724
2020-351356,2020-01-24,000001,Vente,1786.4,,,KERLOUED,B132,29640,29275,Scrignac,29,,,292750000A0667,,,,,,,,,,,,,0,,,,,BR,futaies résineuses,,,9740,-3.742714,48.446291
2020-351440,2020-02-06,000001,Vente,1536,,,KERLOC'H,B127,29640,29275,Scrignac,29,,,292750000B0375,,,,,,,,,,,,,0,,,,,T,terres,,,3840,-3.67529,48.44242
2020-351441,2020-02-06,000001,Vente,2314.5,,,KERLOC'H HUELLA,B129,29640,29275,Scrignac,29,,,292750000B0383,,,,,,,,,,,,,0,,,,,T,terres,,,7715,-3.676635,48.442352
2020-351443,2020-02-12,000002,Vente,6000,,,TRINIVEL,B315,29640,29275,Scrignac,29,,,29275000ZA0083,,,,,,,,,,,,,0,,,,,S,sols,,,2130,-3.737728,48.425074
2020-351443,2020-02-12,000002,Vente,6000,,,TRINIVEL,B315,29640,29275,Scrignac,29,,,29275000ZA0128,,,,,,,,,,,,,0,,,,,S,sols,,,206,-3.737611,48.425195
2020-351447,2020-02-06,000001,Echange,6500,,,KERLOC'H HUELLA,B129,29640,29275,Scrignac,29,,,292750000B0374,,,,,,,,,,,,,0,,,,,T,terres,,,6510,-3.675272,48.442818
2020-351447,2020-02-06,000001,Echange,6500,,,KERLOC'H,B127,29640,29275,Scrignac,29,,,292750000B0375,,,,,,,,,,,,,0,,,,,T,terres,,,3840,-3.67529,48.44242
2020-351447,2020-02-06,000001,Echange,6500,,,KERLOC'H HUELLA,B129,29640,29275,Scrignac,29,,,292750000B0383,,,,,,,,,,,,,0,,,,,T,terres,,,7715,-3.676635,48.442352
2020-351447,2020-02-06,000002,Echange,6500,,,KERDANAOU,B102,29640,29275,Scrignac,29,,,292750000B0494,,,,,,,,,,,,,0,,,,,T,terres,,,10117,-3.680718,48.436388
2020-351447,2020-02-06,000002,Echange,6500,,,KERDANAOU,B102,29640,29275,Scrignac,29,,,292750000B0496,,,,,,,,,,,,,0,,,,,T,terres,,,4958,-3.680456,48.43597
2020-351447,2020-02-06,000002,Echange,6500,,,KERDANAOU,B102,29640,29275,Scrignac,29,,,292750000B0497,,,,,,,,,,,,,0,,,,,T,terres,,,3319,-3.68153,48.43549
2020-351466,2020-02-04,000001,Vente,80000,,,KERSEAC'H,B150,29640,29275,Scrignac,29,,,292750000A0370,,,,,,,,,,,,,0,,,,,BT,taillis simples,,,3254,-3.766341,48.432011
2020-351466,2020-02-04,000001,Vente,80000,,,KERSEAC'H,B150,29640,29275,Scrignac,29,,,292750000A0370,,,,,,,,,,,,,0,,,,,T,terres,,,6506,-3.766341,48.432011
2020-351466,2020-02-04,000001,Vente,80000,,,KERALAIN,B091,29640,29275,Scrignac,29,,,292750000O0784,,,,,,,,,,,,,0,,,,,P,prés,,,11380,-3.69649,48.40976
2020-351466,2020-02-04,000001,Vente,80000,,,KERALAIN,B091,29640,29275,Scrignac,29,,,292750000O0787,,,,,,,,,,,,,0,,,,,BT,taillis simples,,,1630,-3.695528,48.407983
2020-351466,2020-02-04,000001,Vente,80000,,,KERALAIN,B091,29640,29275,Scrignac,29,,,292750000O0791,,,,,,,,,,,,,0,,,,,BT,taillis simples,,,1248,-3.698972,48.409656
2020-351466,2020-02-04,000001,Vente,80000,,,KERALAIN,B091,29640,29275,Scrignac,29,,,292750000O0791,,,,,,,,,,,,,0,,,,,P,prés,,,1248,-3.698972,48.409656
2020-351466,2020-02-04,000001,Vente,80000,,,KERALAIN,B091,29640,29275,Scrignac,29,,,292750000O0792,,,,,,,,,,,,,0,,,,,P,prés,,,10384,-3.69817,48.409723
2020-351466,2020-02-04,000001,Vente,80000,,,KERALAIN,B091,29640,29275,Scrignac,29,,,292750000O0793,,,,,,,,,,,,,0,,,,,P,prés,,,400,-3.697785,48.40983
2020-351466,2020-02-04,000001,Vente,80000,,,KERALAIN,B091,29640,29275,Scrignac,29,,,292750000O0794,,,,,,,,,,,,,0,,,,,P,prés,,,6150,-3.698018,48.410483
2020-351466,2020-02-04,000001,Vente,80000,,,KERALAIN,B091,29640,29275,Scrignac,29,,,292750000O0794,,,,,,,,,,,,,0,,,,,BT,taillis simples,,,2050,-3.698018,48.410483
2020-351466,2020-02-04,000001,Vente,80000,,,KERALAIN,B091,29640,29275,Scrignac,29,,,292750000O0795,,,,,,,,,,,,,0,,,,,P,prés,,,8870,-3.699413,48.410838
2020-351466,2020-02-04,000001,Vente,80000,,,KERALAIN,B091,29640,29275,Scrignac,29,,,292750000O0796,,,,,,,,,,,,,0,,,,,P,prés,,,7280,-3.700013,48.41014
2020-351468,2020-02-05,000001,Vente,10816,,,RTE DE KERNEVEZ,0125,29640,29275,Scrignac,29,,,29275000AB0320,,,,,,,,,,,,,0,,,,,T,terres,,,1352,-3.677014,48.434688
2020-351527,2020-02-27,000001,Vente,129450,,,KERVOEL,B166,29640,29275,Scrignac,29,,,292750000D0531,,,,,,,,,,,,,0,,,,,T,terres,,,7,-3.622821,48.450101
2020-351527,2020-02-27,000001,Vente,129450,,,KERVOEL,B166,29640,29275,Scrignac,29,,,292750000D0533,,,,,,,,,,,,,0,,,,,S,sols,,,608,-3.622531,48.450032
2020-351527,2020-02-27,000001,Vente,129450,,,KERVOEL,B166,29640,29275,Scrignac,29,,,292750000D0535,,,,,,,,,,,,,0,,,,,S,sols,,,359,-3.622607,48.450233
2020-351527,2020-02-27,000001,Vente,129450,350,,KERVOEL,B166,29640,29275,Scrignac,29,,,292750000D0536,,,,,,,,,,,,,0,1,Maison,77,3,S,sols,,,108,-3.622576,48.450124
2020-351527,2020-02-27,000001,Vente,129450,350,,KERVOEL,B166,29640,29275,Scrignac,29,,,292750000D0536,,,,,,,,,,,,,0,3,Dépendance,,0,S,sols,,,108,-3.622576,48.450124
2020-351527,2020-02-27,000001,Vente,129450,,,KERVOEL,B166,29640,29275,Scrignac,29,,,292750000D0547,,,,,,,,,,,,,0,,,,,S,sols,,,253,-3.622582,48.450364
2020-351632,2020-03-05,000001,Vente,30000,21,,RUE FRANCIS KERVOELEN,0098,29640,29275,Scrignac,29,,,29275000AC0245,,,,,,,,,,,,,0,1,Maison,47,2,S,sols,,,278,-3.676592,48.431252
2020-351642,2020-02-27,000001,Vente,91500,,,RUTAN,B305,29640,29275,Scrignac,29,,,292750000O0472,,,,,,,,,,,,,0,,,,,L,landes,,,5727,-3.704644,48.424417
2020-351642,2020-02-27,000001,Vente,91500,,,RUTAN,B305,29640,29275,Scrignac,29,,,292750000O0472,,,,,,,,,,,,,0,,,,,T,terres,,,11453,-3.704644,48.424417
2020-351642,2020-02-27,000001,Vente,91500,,,QUILIVEL,B289,29640,29275,Scrignac,29,,,292750000O0473,,,,,,,,,,,,,0,,,,,T,terres,,,9697,-3.704605,48.425057
2020-351642,2020-02-27,000001,Vente,91500,,,QUILIVEL,B289,29640,29275,Scrignac,29,,,292750000P0630,,,,,,,,,,,,,0,,,,,T,terres,,,1640,-3.711069,48.427016
2020-351642,2020-02-27,000001,Vente,91500,,,QUILIVEL,B289,29640,29275,Scrignac,29,,,292750000P0637,,,,,,,,,,,,,0,,,,,S,sols,,,430,-3.711278,48.42668
2020-351642,2020-02-27,000001,Vente,91500,,,QUILIVEL,B289,29640,29275,Scrignac,29,,,292750000P0808,,,,,,,,,,,,,0,,,,,T,terres,,,324,-3.710751,48.42699
2020-351642,2020-02-27,000001,Vente,91500,252,,QUILIVEL,B289,29640,29275,Scrignac,29,,,292750000P0830,,,,,,,,,,,,,0,1,Maison,72,2,S,sols,,,1428,-3.711324,48.427086
2020-351642,2020-02-27,000001,Vente,91500,,,QUILIVEL,B289,29640,29275,Scrignac,29,,,292750000P0832,,,,,,,,,,,,,0,,,,,S,sols,,,162,-3.711673,48.427246
2020-351642,2020-02-27,000001,Vente,91500,,,QUILIVEL,B289,29640,29275,Scrignac,29,,,292750000P0833,,,,,,,,,,,,,0,,,,,T,terres,,,1172,-3.711674,48.426975
2020-351642,2020-02-27,000001,Vente,91500,,,QUILIVEL,B289,29640,29275,Scrignac,29,,,292750000P0836,,,,,,,,,,,,,0,,,,,L,landes,,,157,-3.711871,48.426705
2020-351714,2020-03-30,000001,Vente,185000,1977,I,KERLOC'H,B127,29640,29275,Scrignac,29,,,292750000B0702,,,,,,,,,,,,,0,1,Maison,107,5,S,sols,,,2935,-3.673227,48.440888
2020-351714,2020-03-30,000001,Vente,185000,,,KERLOC'H,B127,29640,29275,Scrignac,29,,,292750000B0705,,,,,,,,,,,,,0,,,,,P,prés,,,2070,-3.673998,48.440796
2020-351717,2020-03-20,000001,Vente,1000,,,GUERN BRAZ,B079,29640,29275,Scrignac,29,,,292750000M0148,,,,,,,,,,,,,0,,,,,BR,futaies résineuses,,,10640,-3.670358,48.408446
2020-351806,2020-04-24,000001,Vente,73500,,,L'ISLE,B088,29640,29275,Scrignac,29,,,292750000H0811,,,,,,,,,,,,,0,,,,,BT,taillis simples,,,5760,-3.639097,48.413437
2020-351806,2020-04-24,000001,Vente,73500,,,QUEFFORC'H,B280,29640,29275,Scrignac,29,,,292750000I0017,,,,,,,,,,,,,0,,,,,T,terres,,,3900,-3.635903,48.407808
2020-351806,2020-04-24,000001,Vente,73500,,,QUEFFORC'H,B280,29640,29275,Scrignac,29,,,292750000I0018,,,,,,,,,,,,,0,,,,,P,prés,,,5710,-3.636422,48.407323
2020-351806,2020-04-24,000001,Vente,73500,,,QUENEGUEN,B283,29640,29275,Scrignac,29,,,292750000I0028,,,,,,,,,,,,,0,,,,,L,landes,,,3390,-3.63701,48.405748
2020-351806,2020-04-24,000001,Vente,73500,,,STANG FLOC'H,B309,29640,29275,Scrignac,29,,,292750000I0029,,,,,,,,,,,,,0,,,,,L,landes,,,2607,-3.636236,48.406117
2020-351806,2020-04-24,000001,Vente,73500,,,STANG FLOC'H,B309,29640,29275,Scrignac,29,,,292750000I0029,,,,,,,,,,,,,0,,,,,P,prés,,,1303,-3.636236,48.406117
2020-351806,2020-04-24,000001,Vente,73500,,,STANG FLOC'H,B309,29640,29275,Scrignac,29,,,292750000I0030,,,,,,,,,,,,,0,,,,,L,landes,,,2380,-3.635758,48.406293
2020-351806,2020-04-24,000001,Vente,73500,,,QUEFFORC'H,B280,29640,29275,Scrignac,29,,,292750000I0031,,,,,,,,,,,,,0,,,,,T,terres,,,11650,-3.635332,48.406672
2020-351806,2020-04-24,000001,Vente,73500,,,QUEFFORC'H,B280,29640,29275,Scrignac,29,,,292750000I0032,,,,,,,,,,,,,0,,,,,T,terres,,,7470,-3.634132,48.406836
2020-351806,2020-04-24,000001,Vente,73500,,,QUEFFORC'H,B280,29640,29275,Scrignac,29,,,292750000I0055,,,,,,,,,,,,,0,,,,,T,terres,,,8180,-3.631161,48.408365
2020-351806,2020-04-24,000001,Vente,73500,,,QUEFFORC'H,B280,29640,29275,Scrignac,29,,,292750000I0056,,,,,,,,,,,,,0,,,,,T,terres,,,7260,-3.631282,48.409006
2020-351806,2020-04-24,000001,Vente,73500,,,QUEFFORC'H,B280,29640,29275,Scrignac,29,,,292750000I0057,,,,,,,,,,,,,0,,,,,T,terres,,,19760,-3.632719,48.407887