id_mutation,date_mutation,numero_disposition,nature_mutation,valeur_fonciere,adresse_numero,adresse_suffixe,adresse_nom_voie,adresse_code_voie,code_postal,code_commune,nom_commune,code_departement,ancien_code_commune,ancien_nom_commune,id_parcelle,ancien_id_parcelle,numero_volume,lot1_numero,lot1_surface_carrez,lot2_numero,lot2_surface_carrez,lot3_numero,lot3_surface_carrez,lot4_numero,lot4_surface_carrez,lot5_numero,lot5_surface_carrez,nombre_lots,code_type_local,type_local,surface_reelle_bati,nombre_pieces_principales,code_nature_culture,nature_culture,code_nature_culture_speciale,nature_culture_speciale,surface_terrain,longitude,latitude
2020-355265,2020-01-14,000001,Vente,241000,6187,,CHE D'AGNAREDDA,0516,20137,2A247,Porto-Vecchio,2A,,,2A2470000D1704,,,8,17.71,,,,,,,,,1,2,Appartement,66,3,,,,,,9.273185,41.583147
2020-355313,2020-01-22,000001,Vente,549205,9531,,QRT BOCCA DEL ORO,0060,20137,2A247,Porto-Vecchio,2A,,,2A247000AY0063,,,,,,,,,,,,,0,1,Maison,145,5,AG,terrains d'agrément,,,980,9.285642,41.547301
2020-355313,2020-01-22,000001,Vente,549205,9531,,QRT BOCCA DEL ORO,0060,20137,2A247,Porto-Vecchio,2A,,,2A247000AY0063,,,,,,,,,,,,,0,1,Maison,145,5,S,sols,,,500,9.285642,41.547301
2020-355318,2020-01-02,000001,Vente,351720,6119,,QRT CORBA,0105,20137,2A247,Porto-Vecchio,2A,,,2A2470000I1810,,,,,,,,,,,,,0,1,Maison,107,4,S,sols,,,892,,
2020-355319,2020-01-08,000001,Vente en l'état futur d'achèvement,240000,9001,,RTE DE BONIFACIO,0065,20137,2A247,Porto-Vecchio,2A,,,2A247000AC0145,,,105,,,,,,,,,,1,,,,,,,,,,9.275984,41.581834
2020-355319,2020-01-08,000001,Vente en l'état futur d'achèvement,240000,9001,,RTE DE BONIFACIO,0065,20137,2A247,Porto-Vecchio,2A,,,2A247000AC0145,,,37,,,,,,,,,,1,,,,,,,,,,9.275984,41.581834
2020-355319,2020-01-08,000001,Vente en l'état futur d'achèvement,240000,9001,,RTE DE BONIFACIO,0065,20137,2A247,Porto-Vecchio,2A,,,2A247000AC0145,,,104,,,,,,,,,,1,,,,,,,,,,9.275984,41.581834
2020-355323,2020-01-17,000001,Vente en l'état futur d'achèvement,260000,,,LDT LAZZA,0199,20137,2A247,Porto-Vecchio,2A,,,2A2470000D0077,,,611,51,,,,,,,,,1,,,,,,,,,,9.257882,41.583418
2020-355323,2020-01-17,000001,Vente en l'état futur d'achèvement,260000,,,LDT LAZZA,0199,20137,2A247,Porto-Vecchio,2A,,,2A2470000D0077,,,615,,,,,,,,,,1,,,,,,,,,,9.257882,41.583418
2020-355323,2020-01-17,000001,Vente en l'état futur d'achèvement,260000,,,LDT LAZZA,0199,20137,2A247,Porto-Vecchio,2A,,,2A2470000D0077,,,616,,,,,,,,,,1,,,,,,,,,,9.257882,41.583418
2020-355323,2020-01-17,000001,Vente en l'état futur d'achèvement,260000,,,LDT LAZZA,0199,20137,2A247,Porto-Vecchio,2A,,,2A2470000D0077,,,632,,,,,,,,,,1,,,,,,,,,,9.257882,41.583418
2020-355323,2020-01-17,000001,Vente en l'état futur d'achèvement,260000,,,LDT LAZZA,0199,20137,2A247,Porto-Vecchio,2A,,,2A2470000D0077,,,843,,,,,,,,,,1,,,,,,,,,,9.257882,41.583418
2020-355325,2020-01-09,000001,Vente,155000,9003,,LDT FINAGGIO,0139,20137,2A247,Porto-Vecchio,2A,,,2A2470000C1339,,,,,,,,,,,,,0,1,Maison,90,3,S,sols,,,335,9.293276,41.636417
2020-355358,2020-01-21,000001,Vente,124415,9378,,ARMENTAJO,B030,20137,2A247,Porto-Vecchio,2A,,,2A247000AT1125,,,14,18.76,,,,,,,,,1,2,Appartement,18,1,,,,,,9.269903,41.544705
2020-355369,2020-01-15,000001,Vente,426000,6094,,QRT NIVALELLA,0245,20137,2A247,Porto-Vecchio,2A,,,2A2470000B1669,,,1,121.28,,,,,,,,,1,2,Appartement,115,3,,,,,,9.24943,41.620301
2020-355369,2020-01-15,000001,Vente,426000,,,QRT NIVALELLA,0245,20137,2A247,Porto-Vecchio,2A,,,2A2470000B1670,,,,,,,,,,,,,0,,,,,S,sols,,,239,9.249321,41.620348
2020-355379,2020-01-14,000001,Vente,400000,6606,,ARATAGGIU,B024,20137,2A247,Porto-Vecchio,2A,,,2A2470000G1463,,,,,,,,,,,,,0,1,Maison,200,5,S,sols,,,1345,9.278058,41.563909
2020-355380,2020-01-15,000001,Vente,299000,6002,,FOCE INCESA,B187,20137,2A247,Porto-Vecchio,2A,,,2A2470000F2348,,,5,57.93,,,,,,,,,1,4,Local industriel. commercial ou assimilé,61,0,,,,,,9.334778,41.573363
2020-355382,2020-01-17,000001,Vente,90000,6541,,QRT NIVALELLA,0245,20137,2A247,Porto-Vecchio,2A,,,2A2470000B0508,,,1,,,,,,,,,,1,3,Dépendance,,0,,,,,,9.250166,41.619831
2020-355436,2020-01-28,000001,Vente,230000,,,QRT PICCOVAGGIA,0305,20137,2A247,Porto-Vecchio,2A,,,2A2470000F0235,,,,,,,,,,,,,0,1,Maison,45,2,S,sols,,,1273,9.340929,41.58169
2020-355444,2020-01-29,000001,Vente,8000,,,MEZZANE,B298,20137,2A247,Porto-Vecchio,2A,,,2A2470000H0218,,,,,,,,,,,,,0,,,,,T,terres,,,11370,9.217598,41.567028
2020-355508,2020-01-27,000001,Vente,345000,6218,,QRT RENAJOLA,0360,20137,2A247,Porto-Vecchio,2A,,,2A2470000I2439,,,,,,,,,,,,,0,1,Maison,110,4,S,sols,,,770,9.200433,41.589308
2020-355541,2020-02-04,000001,Vente,224350,5111,,LDT ARUTOLI,0016,20137,2A247,Porto-Vecchio,2A,,,2A2470000C2108,,,30,59.17,,,,,,,,,1,2,Appartement,59,2,,,,,,9.261099,41.596906
2020-355541,2020-02-04,000001,Vente,224350,5111,,LDT ARUTOLI,0016,20137,2A247,Porto-Vecchio,2A,,,2A2470000C2108,,,83,,,,,,,,,,1,3,Dépendance,,0,,,,,,9.261099,41.596906
2020-355542,2020-02-05,000001,Vente,220000,9368,A,LDT SANTA GIULIA,0403,20137,2A247,Porto-Vecchio,2A,,,2A247000BK0010,,,40,37.48,74,,,,,,,,2,1,Maison,35,3,,,,,,9.279899,41.537956
2020-355578,2020-01-24,000001,Vente,1905360.8,9,,VC LDT PEZZA CARDO,0290,20137,2A247,Porto-Vecchio,2A,,,2A247000AN0173,,,,,,,,,,,,,0,1,Maison,190,5,S,sols,,,500,9.296556,41.619134
2020-355578,2020-01-24,000001,Vente,1905360.8,9,,VC LDT PEZZA CARDO,0290,20137,2A247,Porto-Vecchio,2A,,,2A247000AN0173,,,,,,,,,,,,,0,1,Maison,190,5,AG,terrains d'agrément,,,723,9.296556,41.619134
2020-355578,2020-01-24,000001,Vente,1905360.8,,,VC LDT PEZZA CARDO,0290,20137,2A247,Porto-Vecchio,2A,,,2A247000AN0219,,,,,,,,,,,,,0,,,,,AB,terrains a bâtir,,,541,9.296744,41.619158
2020-355593,2020-02-03,000001,Vente,313700,6253,,ARMENTAJO,B030,20137,2A247,Porto-Vecchio,2A,,,2A2470000G0889,,,27,85.65,56,,,,,,,,2,2,Appartement,93,4,,,,,,9.277678,41.542705
2020-355595,2020-02-05,000001,Vente,125000,9001,,TENDA,B508,20137,2A247,Porto-Vecchio,2A,,,2A2470000C1155,,,22,,23,,,,,,,,2,4,Local industriel. commercial ou assimilé,55,0,,,,,,9.277704,41.609712
2020-355598,2020-02-17,000001,Vente,180000,,,RUE DU MARECHAL JUIN,0200,20137,2A247,Porto-Vecchio,2A,,,2A247000AC0148,,,10,50.17,,,,,,,,,1,2,Appartement,50,2,,,,,,9.275852,41.581313
2020-355601,2020-02-17,000001,Vente,45000,6,,RUE SAMPIERO,0400,20137,2A247,Porto-Vecchio,2A,,,2A247000AE0295,,,2,,,,,,,,,,1,2,Appartement,32,1,,,,,,9.280591,41.591248
2020-355607,2020-02-04,000001,Vente,250000,6485,,RTE D ARCA,0017,20137,2A247,Porto-Vecchio,2A,,,2A2470000D0077,,,221,49.6,251,,285,,746,,,,4,2,Appartement,50,2,,,,,,9.257882,41.583418
2020-355610,2020-02-04,000001,Vente,140000,,,SAGGIMO,B445,20137,2A247,Porto-Vecchio,2A,,,2A2470000D1899,,,,,,,,,,,,,0,,,,,S,sols,,,1011,9.25934,41.580569
2020-355615,2020-02-12,000001,Vente,150000,,,LDT VETTA,0458,20137,2A247,Porto-Vecchio,2A,,,2A247000AO0327,,,,,,,,,,,,,0,,,,,P,prés,,,356,9.292015,41.627986
2020-355615,2020-02-12,000001,Vente,150000,,,LDT VETTA,0458,20137,2A247,Porto-Vecchio,2A,,,2A247000AP0392,,,,,,,,,,,,,0,,,,,P,prés,,,3251,9.292454,41.627974
2020-355628,2020-02-10,000001,Vente en l'état futur d'achèvement,250000,,,LDT LAZZA,0199,20137,2A247,Porto-Vecchio,2A,,,2A2470000D0077,,,517,,,,,,,,,,1,,,,,,,,,,9.257882,41.583418
2020-355628,2020-02-10,000001,Vente en l'état futur d'achèvement,250000,,,LDT LAZZA,0199,20137,2A247,Porto-Vecchio,2A,,,2A2470000D0077,,,504,50,,,,,,,,,1,,,,,,,,,,9.257882,41.583418
2020-355628,2020-02-10,000001,Vente en l'état futur d'achèvement,250000,,,LDT LAZZA,0199,20137,2A247,Porto-Vecchio,2A,,,2A2470000D0077,,,839,,,,,,,,,,1,,,,,,,,,,9.257882,41.583418
2020-355628,2020-02-10,000001,Vente en l'état futur d'achèvement,250000,,,LDT LAZZA,0199,20137,2A247,Porto-Vecchio,2A,,,2A2470000D0077,,,539,,,,,,,,,,1,,,,,,,,,,9.257882,41.583418
2020-355635,2020-02-09,000001,Vente,1000,,,CHIOSELLA,B126,20137,2A247,Porto-Vecchio,2A,,,2A2470000I1700,,,,,,,,,,,,,0,,,,,S,sols,,,144,9.205903,41.592035
2020-355640,2020-02-10,000001,Vente,13991,,,PARALDETO,B364,20137,2A247,Porto-Vecchio,2A,,,2A2470000I0837,,,,,,,,,,,,,0,,,,,P,prés,,,507,9.212885,41.586125
2020-355640,2020-02-10,000001,Vente,13991,,,PARALDETO,B364,20137,2A247,Porto-Vecchio,2A,,,2A2470000I0838,,,,,,,,,,,,,0,,,,,P,prés,,,3800,9.213159,41.585886
2020-355640,2020-02-10,000001,Vente,13991,,,PARALDETO,B364,20137,2A247,Porto-Vecchio,2A,,,2A2470000I0839,,,,,,,,,,,,,0,,,,,B,bois,CHLIE,Chênes-lièges,15680,9.214844,41.58635
2020-355646,2020-02-03,000001,Vente,1445096,9558,,BACALDIVA,B036,20137,2A247,Porto-Vecchio,2A,,,2A2470000C1811,,,,,,,,,,,,,0,1,Maison,190,6,S,sols,,,1000,9.278056,41.628783
2020-355646,2020-02-03,000001,Vente,1445096,9558,,BACALDIVA,B036,20137,2A247,Porto-Vecchio,2A,,,2A2470000C1811,,,,,,,,,,,,,0,3,Dépendance,,0,B,bois,CHLIE,Chênes-lièges,5000,9.278056,41.628783
2020-355646,2020-02-03,000001,Vente,1445096,9558,,BACALDIVA,B036,20137,2A247,Porto-Vecchio,2A,,,2A2470000C1811,,,,,,,,,,,,,0,1,Maison,190,6,B,bois,CHLIE,Chênes-lièges,5000,9.278056,41.628783
2020-355646,2020-02-03,000001,Vente,1445096,9558,,BACALDIVA,B036,20137,2A247,Porto-Vecchio,2A,,,2A2470000C1811,,,,,,,,,,,,,0,3,Dépendance,,0,AG,terrains d'agrément,,,4000,9.278056,41.628783
2020-355646,2020-02-03,000001,Vente,1445096,9558,,BACALDIVA,B036,20137,2A247,Porto-Vecchio,2A,,,2A2470000C1811,,,,,,,,,,,,,0,1,Maison,190,6,AG,terrains d'agrément,,,4000,9.278056,41.628783
2020-355646,2020-02-03,000001,Vente,1445096,9558,,BACALDIVA,B036,20137,2A247,Porto-Vecchio,2A,,,2A2470000C1811,,,,,,,,,,,,,0,3,Dépendance,,0,S,sols,,,1000,9.278056,41.628783
2020-355652,2020-01-30,000002,Vente,4000,9004,,LDT FINAGGIO,0139,20137,2A247,Porto-Vecchio,2A,,,2A2470000C2601,,,,,,,,,,,,,0,2,Appartement,130,6,,,,,,9.293446,41.636419
2020-355652,2020-01-30,000002,Vente,4000,9004,,LDT FINAGGIO,0139,20137,2A247,Porto-Vecchio,2A,,,2A2470000C2601,,,,,,,,,,,,,0,2,Appartement,34,2,,,,,,9.293446,41.636419
2020-355652,2020-01-30,000002,Vente,4000,9004,,LDT FINAGGIO,0139,20137,2A247,Porto-Vecchio,2A,,,2A2470000C2601,,,,,,,,,,,,,0,2,Appartement,20,1,,,,,,9.293446,41.636419
2020-355652,2020-01-30,000002,Vente,4000,9004,,LDT FINAGGIO,0139,20137,2A247,Porto-Vecchio,2A,,,2A2470000C2601,,,,,,,,,,,,,0,2,Appartement,70,3,,,,,,9.293446,41.636419
2020-355663,2020-02-10,000001,Vente en l'état futur d'achèvement,339000,,,LDT BONIFAZINCO,0067,20137,2A247,Porto-Vecchio,2A,,,2A247000BC0153,,,60,,,,,,,,,,1,,,,,,,,,,9.275969,41.579163
2020-355663,2020-02-10,000001,Vente en l'état futur d'achèvement,339000,,,LDT BONIFAZINCO,0067,20137,2A247,Porto-Vecchio,2A,,,2A247000BC0153,,,8,,,,,,,,,,1,,,,,,,,,,9.275969,41.579163
2020-355664,2020-02-18,000001,Vente,280000,9185,,FOCE DI TERMINI,0146,20137,2A247,Porto-Vecchio,2A,,,2A247000AN0346,,,,,,,,,,,,,0,1,Maison,80,3,S,sols,,,514,9.297304,41.623851
2020-355710,2020-02-14,000001,Vente en l'état futur d'achèvement,455000,,,LDT LAZZA,0199,20137,2A247,Porto-Vecchio,2A,,,2A2470000D0077,,,629,,,,,,,,,,1,,,,,,,,,,9.257882,41.583418
2020-355710,2020-02-14,000001,Vente en l'état futur d'achèvement,455000,,,LDT LAZZA,0199,20137,2A247,Porto-Vecchio,2A,,,2A2470000D0077,,,626,,,,,,,,,,1,,,,,,,,,,9.257882,41.583418
2020-355710,2020-02-14,000001,Vente en l'état futur d'achèvement,455000,,,LDT LAZZA,0199,20137,2A247,Porto-Vecchio,2A,,,2A2470000D0077,,,601,55,,,,,,,,,1,,,,,,,,,,9.257882,41.583418
2020-355710,2020-02-14,000001,Vente en l'état futur d'achèvement,455000,,,LDT LAZZA,0199,20137,2A247,Porto-Vecchio,2A,,,2A2470000D0077,,,602,49,,,,,,,,,1,,,,,,,,,,9.257882,41.583418
2020-355710,2020-02-14,000001,Vente en l'état futur d'achèvement,455000,,,LDT LAZZA,0199,20137,2A247,Porto-Vecchio,2A,,,2A2470000D0077,,,844,,,,,,,,,,1,,,,,,,,,,9.257882,41.583418
2020-355722,2020-02-05,000001,Vente,388130,9575,,LDT VIGNOLA,0463,20137,2A247,Porto-Vecchio,2A,,,2A2470000C1718,,,,,,,,,,,,,0,1,Maison,80,4,S,sols,,,500,9.243765,41.60342
2020-355722,2020-02-05,000001,Vente,388130,9575,,LDT VIGNOLA,0463,20137,2A247,Porto-Vecchio,2A,,,2A2470000C1718,,,,,,,,,,,,,0,1,Maison,80,4,AG,terrains d'agrément,,,776,9.243765,41.60342
2020-355722,2020-02-05,000001,Vente,388130,,,LDT VIGNOLA,0463,20137,2A247,Porto-Vecchio,2A,,,2A2470000C1747,,,,,,,,,,,,,0,,,,,S,sols,,,303,9.243958,41.603597
2020-355727,2020-02-18,000001,Vente,370000,,,MARINA DI FIORI,0209,20137,2A247,Porto-Vecchio,2A,,,2A247000AM0124,,,,,,,,,,,,,0,,,,,AB,terrains a bâtir,,,1525,9.293968,41.612802
2020-355743,2020-02-18,000001,Vente,6400000,9001,,LDT TAGLIO DELLA CROCE,0427,20137,2A247,Porto-Vecchio,2A,,,2A2470000F2713,,,,,,,,,,,,,0,1,Maison,258,9,S,sols,,,1000,,
2020-355743,2020-02-18,000001,Vente,6400000,9001,,LDT TAGLIO DELLA CROCE,0427,20137,2A247,Porto-Vecchio,2A,,,2A2470000F2713,,,,,,,,,,,,,0,1,Maison,258,9,B,bois,MAQUI,Maquis,47695,,
2020-355768,2020-02-25,000001,Vente,443140,6212,,QRT CECCIA,0080,20137,2A247,Porto-Vecchio,2A,,,2A247000BO0116,,,,,,,,,,,,,0,1,Maison,96,3,S,sols,,,1435,9.238536,41.556454
2020-355790,2020-03-02,000001,Vente,678000,5001,,FOCE INCESA,B187,20137,2A247,Porto-Vecchio,2A,,,2A2470000F2435,,,1,98.77,,,,,,,,,1,1,Maison,114,6,,,,,,,
2020-355793,2020-02-27,000001,Vente,511985,9548,,QRT TRINITE,0451,20137,2A247,Porto-Vecchio,2A,,,2A247000AO0227,,,,,,,,,,,,,0,3,Dépendance,,0,AG,terrains d'agrément,,,698,9.287823,41.625074
2020-355793,2020-02-27,000001,Vente,511985,9548,,QRT TRINITE,0451,20137,2A247,Porto-Vecchio,2A,,,2A247000AO0227,,,,,,,,,,,,,0,2,Appartement,70,3,AG,terrains d'agrément,,,698,9.287823,41.625074
2020-355793,2020-02-27,000001,Vente,511985,9548,,QRT TRINITE,0451,20137,2A247,Porto-Vecchio,2A,,,2A247000AO0227,,,,,,,,,,,,,0,3,Dépendance,,0,S,sols,,,1000,9.287823,41.625074
2020-355793,2020-02-27,000001,Vente,511985,9548,,QRT TRINITE,0451,20137,2A247,Porto-Vecchio,2A,,,2A247000AO0227,,,,,,,,,,,,,0,2,Appartement,70,3,S,sols,,,1000,9.287823,41.625074
2020-355793,2020-02-27,000001,Vente,511985,9548,,QRT TRINITE,0451,20137,2A247,Porto-Vecchio,2A,,,2A247000AO0227,,,,,,,,,,,,,0,2,Appartement,42,2,S,sols,,,1000,9.287823,41.625074
2020-355793,2020-02-27,000001,Vente,511985,9548,,QRT TRINITE,0451,20137,2A247,Porto-Vecchio,2A,,,2A247000AO0227,,,,,,,,,,,,,0,2,Appartement,42,2,AG,terrains d'agrément,,,698,9.287823,41.625074
2020-355826,2020-02-27,000001,Vente,175000,7,,VOIE ROMAINE,0375,20137,2A247,Porto-Vecchio,2A,,,2A247000AE0644,,,73,124.14,,,,,,,,,1,4,Local industriel. commercial ou assimilé,78,0,,,,,,9.279796,41.587822
2020-355841,2020-02-26,000001,Vente en l'état futur d'achèvement,334000,,,,,,2A247,Porto-Vecchio,2A,,,2A247000BC0153,,,12,,,,,,,,,,1,,,,,,,,,,9.275969,41.579163
2020-355841,2020-02-26,000001,Vente en l'état futur d'achèvement,334000,,,,,,2A247,Porto-Vecchio,2A,,,2A247000BC0153,,,82,72.06,,,,,,,,,1,,,,,,,,,,9.275969,41.579163
2020-355843,2020-02-26,000001,Vente,198000,6079,,CHE D'AGNAREDDA,0516,20137,2A247,Porto-Vecchio,2A,,,2A2470000D1522,,,116,50.18,33,,,,,,,,2,2,Appartement,51,2,,,,,,9.272633,41.582666
2020-355887,2020-03-03,000001,Vente,455960,5000,,LOT ALPLANA DI VETTA,A459,20137,2A247,Porto-Vecchio,2A,,,2A247000AP0221,,,12,125.84,,,,,,,,,1,1,Maison,98,3,,,,,,9.296812,41.628637
2020-355919,2020-03-05,000001,Vente,20475,,,LDT CALDAJA,0077,20137,2A247,Porto-Vecchio,2A,,,2A2470000F3070,,,,,,,,,,,,,0,,,,,AG,terrains d'agrément,,,225,9.298425,41.581708
2020-355924,2020-02-22,000001,Vente en l'état futur d'achèvement,190000,,,RUE PASTEUR,0285,20137,2A247,Porto-Vecchio,2A,,,2A247000AD0166,,,18,,,,,,,,,,1,,,,,,,,,,9.281763,41.592667
2020-355930,2020-03-09,000001,Vente,192440,6086,,RES LA MARINE DE MATONARA,A020,20137,2A247,Porto-Vecchio,2A,,,2A247000AD0046,,,25,46.47,,,,,,,,,1,2,Appartement,29,1,,,,,,9.278675,41.59542
2020-355934,2020-03-06,000001,Vente,48000,26,,RUE BORGO,0068,20137,2A247,Porto-Vecchio,2A,,,2A247000AE0338,,,4,,,,,,,,,,1,3,Dépendance,,0,,,,,,9.280085,41.590416
2020-355945,2020-02-25,000001,Vente,891515,3,B,LDT VETTA,0458,20137,2A247,Porto-Vecchio,2A,,,2A247000AP0334,,,,,,,,,,,,,0,1,Maison,155,5,AG,terrains d'agrément,,,800,9.294604,41.628023
2020-355945,2020-02-25,000001,Vente,891515,3,B,LDT VETTA,0458,20137,2A247,Porto-Vecchio,2A,,,2A247000AP0334,,,,,,,,,,,,,0,1,Maison,155,5,S,sols,,,500,9.294604,41.628023
2020-355963,2020-02-18,000001,Vente,212000,9001,,RUE DU 9 SEPTEMBRE,0039,20137,2A247,Porto-Vecchio,2A,,,2A247000AC0208,,,154,38.46,,,,,,,,,1,4,Local industriel. commercial ou assimilé,57,0,,,,,,9.283458,41.583722
2020-355964,2020-03-10,000001,Vente,340000,,,QRT BOCCA DEL ORO,0060,20137,2A247,Porto-Vecchio,2A,,,2A247000AY0056,,,,,,,,,,,,,0,,,,,T,terres,,,665,9.284546,41.5462
2020-355964,2020-03-10,000001,Vente,340000,9521,,QRT BOCCA DEL ORO,0060,20137,2A247,Porto-Vecchio,2A,,,2A247000AY0371,,,,,,,,,,,,,0,1,Maison,160,4,S,sols,,,584,9.285023,41.546083
2020-355969,2020-02-11,000002,Vente,917000,,,CATABELLA,B111,20137,2A247,Porto-Vecchio,2A,,,2A2470000A0558,,,,,,,,,,,,,0,,,,,T,terres,,,455280,9.230995,41.620304
2020-355969,2020-02-11,000002,Vente,917000,,,CATABELLA,B111,20137,2A247,Porto-Vecchio,2A,,,2A2470000A0561,,,,,,,,,,,,,0,,,,,T,terres,,,4720,9.236451,41.619568
2020-355969,2020-02-11,000002,Vente,917000,,,CATABELLA,B111,20137,2A247,Porto-Vecchio,2A,,,2A2470000A0562,,,,,,,,,,,,,0,,,,,T,terres,,,6640,9.235164,41.618995
2020-355969,2020-02-11,000002,Vente,917000,,,CATABELLA,B111,20137,2A247,Porto-Vecchio,2A,,,2A2470000A0764,,,,,,,,,,,,,0,,,,,B,bois,CHVER,Chênes -verts,1772,9.225458,41.62011
2020-355969,2020-02-11,000002,Vente,917000,9001,,CATABELLA,B111,20137,2A247,Porto-Vecchio,2A,,,2A2470000A1313,,,,,,,,,,,,,0,1,Maison,55,2,S,sols,,,510,9.228014,41.622504
2020-355969,2020-02-11,000002,Vente,917000,9001,,CATABELLA,B111,20137,2A247,Porto-Vecchio,2A,,,2A2470000A1313,,,,,,,,,,,,,0,1,Maison,80,3,S,sols,,,510,9.228014,41.622504
2020-355969,2020-02-11,000002,Vente,917000,9001,,CATABELLA,B111,20137,2A247,Porto-Vecchio,2A,,,2A2470000A1313,,,,,,,,,,,,,0,1,Maison,65,3,S,sols,,,510,9.228014,41.622504
2020-355969,2020-02-11,000002,Vente,917000,,,CATABELLA,B111,20137,2A247,Porto-Vecchio,2A,,,2A2470000A1314,,,,,,,,,,,,,0,,,,,S,sols,,,1545,9.227994,41.621977
2020-355969,2020-02-11,000002,Vente,917000,,,MUCHIASPRO,B325,20137,2A247,Porto-Vecchio,2A,,,2A2470000B0709,,,,,,,,,,,,,0,,,,,B,bois,MAQUI,Maquis,7320,9.236778,41.619492
2020-355969,2020-02-11,000002,Vente,917000,,,MUCHIASPRO,B325,20137,2A247,Porto-Vecchio,2A,,,2A2470000B0822,,,,,,,,,,,,,0,,,,,VE,vergers,,,1840,9.235389,41.618826
2020-355994,2020-03-09,000001,Vente,400000,9105,,QRT PICCOVAGGIA,0305,20137,2A247,Porto-Vecchio,2A,,,2A2470000F0130,,,,,,,,,,,,,0,1,Maison,87,3,T,terres,,,3100,,
2020-355994,2020-03-09,000001,Vente,400000,9105,,QRT PICCOVAGGIA,0305,20137,2A247,Porto-Vecchio,2A,,,2A2470000F0130,,,,,,,,,,,,,0,1,Maison,87,3,S,sols,,,1000,,
2020-355995,2020-03-10,000001,Vente,90000,9001,,RES L HORIZON BLEU,A495,20137,2A247,Porto-Vecchio,2A,,,2A247000AH0103,,,335,,344,26.75,,,,,,,2,2,Appartement,27,1,,,,,,9.278784,41.586956
2020-356007,2020-03-07,000001,Vente,336825,,,QRT TERRE VECCHIE,0435,20137,2A247,Porto-Vecchio,2A,,,2A2470000I0775,,,,,,,,,,,,,0,,,,,T,terres,,,480,9.212522,41.591666
2020-356007,2020-03-07,000001,Vente,336825,,,QRT TERRE VECCHIE,0435,20137,2A247,Porto-Vecchio,2A,,,2A2470000I2578,,,,,,,,,,,,,0,,,,,T,terres,,,631,9.212369,41.59181
2020-356007,2020-03-07,000001,Vente,336825,,,QRT TERRE VECCHIE,0435,20137,2A247,Porto-Vecchio,2A,,,2A2470000I2580,,,,,,,,,,,,,0,,,,,T,terres,,,130,9.212562,41.591882
2020-356045,2020-03-12,000001,Vente en l'état futur d'achèvement,325000,,,,,,2A247,Porto-Vecchio,2A,,,2A247000BC0153,,,34,,,,,,,,,,1,,,,,,,,,,9.275969,41.579163
2020-356045,2020-03-12,000001,Vente en l'état futur d'achèvement,325000,,,,,,2A247,Porto-Vecchio,2A,,,2A247000BC0153,,,72,,,,,,,,,,1,,,,,,,,,,9.275969,41.579163
2020-356055,2020-03-11,000001,Vente,182880,9001,,TENDA,B508,20137,2A247,Porto-Vecchio,2A,,,2A2470000C1155,,,176,,,,,,,,,,1,4,Local industriel. commercial ou assimilé,45,0,,,,,,9.277704,41.609712
2020-356055,2020-03-11,000001,Vente,182880,9499,,BOCCAJO,0061,20137,2A247,Porto-Vecchio,2A,,,2A2470000D0999,,,4,,,,,,,,,,1,2,Appartement,27,1,,,,,,9.270326,41.593529
2020-356056,2020-02-28,000001,Vente,338880,23,,RES SANTA GIULIA PALACE,A521,20137,2A247,Porto-Vecchio,2A,,,2A247000BK0092,,,24,52.73,,,,,,,,,1,2,Appartement,52,3,,,,,,9.275865,41.536121
2020-356059,2020-03-05,000001,Vente,433970,6440,,LDT CONTI,0102,20137,2A247,Porto-Vecchio,2A,,,2A247000BM0075,,,1,97.9,,,,,,,,,1,2,Appartement,97,4,,,,,,9.246525,41.506089
2020-356081,2020-03-12,000001,Vente,160000,9001,,TENDA,B508,20137,2A247,Porto-Vecchio,2A,,,2A2470000C1155,,,115,,116,,117,,118,,,,4,4,Local industriel. commercial ou assimilé,50,0,,,,,,9.277704,41.609712
2020-356083,2020-03-16,000001,Vente,230000,9001,,TENDA,B508,20137,2A247,Porto-Vecchio,2A,,,2A2470000C1155,,,52,82.66,,,,,,,,,1,2,Appartement,84,4,,,,,,9.277704,41.609712
2020-356083,2020-03-16,000001,Vente,230000,9001,,TENDA,B508,20137,2A247,Porto-Vecchio,2A,,,2A2470000C1155,,,146,,,,,,,,,,1,4,Local industriel. commercial ou assimilé,30,0,,,,,,9.277704,41.609712
2020-356084,2020-03-17,000001,Vente,376100,9801,,QRT PRECOJO,0340,20137,2A247,Porto-Vecchio,2A,,,2A247000AT0082,,,,,,,,,,,,,0,1,Maison,110,4,S,sols,,,525,9.26532,41.551262
2020-356128,2020-02-10,000001,Vente,277725,35,,RES SANTA GIULIA PALACE,A521,20137,2A247,Porto-Vecchio,2A,,,2A247000BK0092,,,35,40.71,,,,,,,,,1,2,Appartement,40,2,,,,,,9.275865,41.536121
2020-356141,2020-03-06,000001,Vente,600000,,,PAVELLONE,0288,20137,2A247,Porto-Vecchio,2A,,,2A247000AR0044,,,,,,,,,,,,,0,,,,,L,landes,,,1520,9.333682,41.599763
2020-356141,2020-03-06,000001,Vente,600000,9448,,PAVELLONE,0288,20137,2A247,Porto-Vecchio,2A,,,2A247000AR0084,,,11,45.71,12,60.31,,,,,,,2,1,Maison,108,5,,,,,,9.332899,41.599262
2020-356143,2020-03-17,000001,Vente,30000,,,LDT CARRUCCINO,0086,20137,2A247,Porto-Vecchio,2A,,,2A2470000D1919,,,,,,,,,,,,,0,,,,,S,sols,,,957,9.261394,41.580754
2020-356144,2020-03-16,000001,Vente,480000,18,,RUE JEAN JAURES,0170,20137,2A247,Porto-Vecchio,2A,,,2A247000AE0484,,,9,,,,,,,,,,1,2,Appartement,65,3,,,,,,9.276368,41.589754
2020-356144,2020-03-16,000001,Vente,480000,18,,RUE JEAN JAURES,0170,20137,2A247,Porto-Vecchio,2A,,,2A247000AE0484,,,10,,,,,,,,,,1,2,Appartement,70,3,,,,,,9.276368,41.589754
2020-356144,2020-03-16,000001,Vente,480000,,,RUE JEAN JAURES,0170,20137,2A247,Porto-Vecchio,2A,,,2A247000AE0608,,,,,,,,,,,,,0,,,,,T,terres,,,326,9.276222,41.589961
2020-356150,2020-02-10,000001,Vente,1145000,3,,LOT LES CHENES,A017,20137,2A247,Porto-Vecchio,2A,,,2A247000BP0141,,,,,,,,,,,,,0,1,Maison,221,5,S,sols,,,500,9.305362,41.587162
2020-356150,2020-02-10,000001,Vente,1145000,3,,LOT LES CHENES,A017,20137,2A247,Porto-Vecchio,2A,,,2A247000BP0141,,,,,,,,,,,,,0,1,Maison,221,5,AG,terrains d'agrément,,,1826,9.305362,41.587162
2020-356160,2020-04-04,000001,Vente,380000,9325,,QRT LA MARINE,0201,20137,2A247,Porto-Vecchio,2A,,,2A247000AI0016,,,29,86.24,,,,,,,,,1,2,Appartement,86,4,,,,,,9.283755,41.588816
2020-356162,2020-04-02,000001,Vente,254275,9279,,LDT VIGNOLA,0463,20137,2A247,Porto-Vecchio,2A,,,2A247000AC0018,,,,,,,,,,,,,0,1,Maison,65,4,S,sols,,,223,9.282972,41.585398
2020-356162,2020-04-02,000001,Vente,254275,9279,,LDT VIGNOLA,0463,20137,2A247,Porto-Vecchio,2A,,,2A247000AC0018,,,,,,,,,,,,,0,1,Maison,62,3,S,sols,,,223,9.282972,41.585398
2020-356164,2020-04-10,000001,Vente,1131850,9267,,QRT BENCIUGNO,0048,20137,2A247,Porto-Vecchio,2A,,,2A2470000C2057,,,,,,,,,,,,,0,1,Maison,250,5,S,sols,,,2394,9.280316,41.628714
2020-356183,2020-03-12,000001,Vente en l'état futur d'achèvement,303000,,,LDT BONIFAZINCO,0067,20137,2A247,Porto-Vecchio,2A,,,2A247000BC0153,,,66,51.31,,,,,,,,,1,,,,,,,,,,9.275969,41.579163
2020-356183,2020-03-12,000001,Vente en l'état futur d'achèvement,303000,,,LDT BONIFAZINCO,0067,20137,2A247,Porto-Vecchio,2A,,,2A247000BC0153,,,33,16.5,,,,,,,,,1,,,,,,,,,,9.275969,41.579163
2020-356221,2020-04-21,000001,Vente,2017200,16,,LOT PUNTA D'ORO,0046,20137,2A247,Porto-Vecchio,2A,,,2A2470000F2206,,,,,,,,,,,,,0,1,Maison,322,9,S,sols,,,2147,,
2020-356290,2020-04-30,000001,Vente,950000,9002,,ORO,B334,20137,2A247,Porto-Vecchio,2A,,,2A2470000G0653,,,,,,,,,,,,,0,2,Appartement,27,2,S,sols,,,500,9.282435,41.55347