id_mutation,date_mutation,numero_disposition,nature_mutation,valeur_fonciere,adresse_numero,adresse_suffixe,adresse_nom_voie,adresse_code_voie,code_postal,code_commune,nom_commune,code_departement,ancien_code_commune,ancien_nom_commune,id_parcelle,ancien_id_parcelle,numero_volume,lot1_numero,lot1_surface_carrez,lot2_numero,lot2_surface_carrez,lot3_numero,lot3_surface_carrez,lot4_numero,lot4_surface_carrez,lot5_numero,lot5_surface_carrez,nombre_lots,code_type_local,type_local,surface_reelle_bati,nombre_pieces_principales,code_nature_culture,nature_culture,code_nature_culture_speciale,nature_culture_speciale,surface_terrain,longitude,latitude
2020-360786,2020-07-07,000001,Vente,90000,,,SCALELLE,B280,20250,2B306,Santa-Lucia-di-Mercurio,2B,,,2B3060000E0510,,,,,,,,,,,,,0,,,,,S,sols,,,33,9.220957,42.326461
2020-360786,2020-07-07,000001,Vente,90000,,,SCALELLE,B280,20250,2B306,Santa-Lucia-di-Mercurio,2B,,,2B3060000E0511,,,,,,,,,,,,,0,,,,,S,sols,,,91,9.220874,42.326423
2020-360786,2020-07-07,000001,Vente,90000,,,SCALELLE,B280,20250,2B306,Santa-Lucia-di-Mercurio,2B,,,2B3060000E0519,,,,,,,,,,,,,0,,,,,S,sols,,,58,9.221037,42.326439
2020-361054,2020-07-22,000001,Vente,80000,5058,,COLLETOLA,B088,20250,2B306,Santa-Lucia-di-Mercurio,2B,,,2B3060000E0492,,,,,,,,,,,,,0,1,Maison,64,3,S,sols,,,80,9.221199,42.326639
2020-361467,2020-08-26,000001,Vente,1200,,,PIED DI VALDO,B224,20250,2B306,Santa-Lucia-di-Mercurio,2B,,,2B3060000E0303,,,,,,,,,,,,,0,,,,,S,sols,,,42,9.226629,42.325444
2020-361467,2020-08-26,000001,Vente,1200,5038,,PIED DI VALDO,B224,20250,2B306,Santa-Lucia-di-Mercurio,2B,,,2B3060000E0304,,,9,,,,,,,,,,1,2,Appartement,14,1,,,,,,9.226665,42.325524
2020-361467,2020-08-26,000001,Vente,1200,5038,,PIED DI VALDO,B224,20250,2B306,Santa-Lucia-di-Mercurio,2B,,,2B3060000E0304,,,9,,,,,,,,,,1,3,Dépendance,,0,,,,,,9.226665,42.325524
2020-361556,2020-08-26,000001,Vente,1200,,,PIED DI VALDO,B224,20250,2B306,Santa-Lucia-di-Mercurio,2B,,,2B3060000E0303,,,,,,,,,,,,,0,,,,,S,sols,,,42,9.226629,42.325444
2020-361556,2020-08-26,000001,Vente,1200,5038,,PIED DI VALDO,B224,20250,2B306,Santa-Lucia-di-Mercurio,2B,,,2B3060000E0304,,,8,84,,,,,,,,,1,3,Dépendance,,0,,,,,,9.226665,42.325524
2020-361556,2020-08-26,000001,Vente,1200,5038,,PIED DI VALDO,B224,20250,2B306,Santa-Lucia-di-Mercurio,2B,,,2B3060000E0304,,,8,84,,,,,,,,,1,2,Appartement,14,1,,,,,,9.226665,42.325524
