id_mutation,date_mutation,numero_disposition,nature_mutation,valeur_fonciere,adresse_numero,adresse_suffixe,adresse_nom_voie,adresse_code_voie,code_postal,code_commune,nom_commune,code_departement,ancien_code_commune,ancien_nom_commune,id_parcelle,ancien_id_parcelle,numero_volume,lot1_numero,lot1_surface_carrez,lot2_numero,lot2_surface_carrez,lot3_numero,lot3_surface_carrez,lot4_numero,lot4_surface_carrez,lot5_numero,lot5_surface_carrez,nombre_lots,code_type_local,type_local,surface_reelle_bati,nombre_pieces_principales,code_nature_culture,nature_culture,code_nature_culture_speciale,nature_culture_speciale,surface_terrain,longitude,latitude
2020-363727,2020-01-29,000001,Vente,31000,5026,,RUE HAUTE,0031,30260,30066,Cannes-et-Clairan,30,,,30066000AI0039,,,,,,,,,,,,,0,1,Maison,79,3,S,sols,,,80,4.08375,43.900696
2020-363861,2020-01-31,000002,Vente,75000,,,COURMET EST,B013,30260,30066,Cannes-et-Clairan,30,,,30066000AH0314,,,,,,,,,,,,,0,,,,,VE,vergers,OLIVE,Oliveraie ou oliviers,2844,4.086392,43.90389
2020-364721,2020-03-17,000001,Vente,5680,,,TERRE NEGRE,B051,30260,30066,Cannes-et-Clairan,30,,,30066000AK0100,,,,,,,,,,,,,0,,,,,T,terres,,,2940,4.089069,43.893734
2020-364721,2020-03-17,000001,Vente,5680,,,LA FESQUE,B016,30260,30066,Cannes-et-Clairan,30,,,30066000AL0160,,,,,,,,,,,,,0,,,,,T,terres,,,2001,4.08364,43.88923
2020-364721,2020-03-17,000001,Vente,5680,,,LES COMBES,B009,30260,30066,Cannes-et-Clairan,30,,,30066000AM0060,,,,,,,,,,,,,0,,,,,BT,taillis simples,,,4205,4.067075,43.908954
2020-364721,2020-03-17,000001,Vente,5680,,,LES COMBES,B009,30260,30066,Cannes-et-Clairan,30,,,30066000AM0063,,,,,,,,,,,,,0,,,,,BT,taillis simples,,,4075,4.068071,43.907799
2020-364721,2020-03-17,000001,Vente,5680,,,PIED DU FAOU,B030,30260,30066,Cannes-et-Clairan,30,,,30066000AM0365,,,,,,,,,,,,,0,,,,,T,terres,,,6865,4.065949,43.907761
2020-364721,2020-03-17,000001,Vente,5680,,,VALDUROLLE,B054,30260,30066,Cannes-et-Clairan,30,,,30066000AO0152,,,,,,,,,,,,,0,,,,,T,terres,,,1035,4.068562,43.910383
2020-365451,2020-05-15,000001,Vente,252000,,,LE MAZET,B026,30260,30066,Cannes-et-Clairan,30,,,30066000AN0267,,,,,,,,,,,,,0,,,,,T,terres,,,492,4.083267,43.901832
2020-365451,2020-05-15,000001,Vente,252000,5144,,CHE DU MAS DE COUTELLE,0017,30260,30066,Cannes-et-Clairan,30,,,30066000AN0268,,,,,,,,,,,,,0,1,Maison,103,5,S,sols,,,942,4.0831,43.901947
2020-366171,2020-06-04,000001,Vente,140000,5207,,LE VILLAGE,B055,30260,30066,Cannes-et-Clairan,30,,,30066000AI0207,,,,,,,,,,,,,0,1,Maison,90,3,S,sols,,,359,4.084138,43.900025
2020-366351,2020-06-17,000001,Vente,128730,5010,,RUE DE LA FONT DU LOUP,0023,30260,30066,Cannes-et-Clairan,30,,,30066000AI0021,,,,,,,,,,,,,0,1,Maison,150,8,S,sols,,,185,4.082906,43.900217
2020-368736,2020-08-26,000001,Vente,168000,,,L ARBOUSSEDE,B001,30260,30066,Cannes-et-Clairan,30,,,30066000AH0036,,,,,,,,,,,,,0,,,,,BT,taillis simples,,,7983,4.0928,43.913784
2020-368736,2020-08-26,000001,Vente,168000,,,L ARBOUSSEDE,B001,30260,30066,Cannes-et-Clairan,30,,,30066000AH0046,,,,,,,,,,,,,0,,,,,BT,taillis simples,,,420,4.092837,43.91524
2020-368736,2020-08-26,000001,Vente,168000,,,L ARBOUSSEDE,B001,30260,30066,Cannes-et-Clairan,30,,,30066000AH0047,,,,,,,,,,,,,0,,,,,BT,taillis simples,,,2866,4.093528,43.915737
2020-368736,2020-08-26,000001,Vente,168000,,,L ARBOUSSEDE,B001,30260,30066,Cannes-et-Clairan,30,,,30066000AH0062,,,,,,,,,,,,,0,,,,,BT,taillis simples,,,6585,4.091085,43.914283
2020-368736,2020-08-26,000001,Vente,168000,,,L ARBOUSSEDE,B001,30260,30066,Cannes-et-Clairan,30,,,30066000AH0064,,,,,,,,,,,,,0,,,,,BT,taillis simples,,,4240,4.090487,43.912726
2020-368736,2020-08-26,000001,Vente,168000,,,L ARBOUSSEDE,B001,30260,30066,Cannes-et-Clairan,30,,,30066000AH0071,,,,,,,,,,,,,0,,,,,BT,taillis simples,,,6475,4.088564,43.908524
2020-368736,2020-08-26,000001,Vente,168000,,,COURMET EST,B013,30260,30066,Cannes-et-Clairan,30,,,30066000AH0099,,,,,,,,,,,,,0,,,,,L,landes,PATUR,Pâture plantée,1650,4.088542,43.914249
2020-368736,2020-08-26,000001,Vente,168000,,,LE VILLAGE,B055,30260,30066,Cannes-et-Clairan,30,,,30066000AI0055,,,,,,,,,,,,,0,,,,,S,sols,,,216,4.084744,43.901134
2020-368736,2020-08-26,000001,Vente,168000,,,LE VILLAGE,B055,30260,30066,Cannes-et-Clairan,30,,,30066000AI0070,,,,,,,,,,,,,0,,,,,S,sols,,,493,4.084694,43.900909
2020-368736,2020-08-26,000001,Vente,168000,5041,,RUE DES GORGUES,0025,30260,30066,Cannes-et-Clairan,30,,,30066000AI0085,,,,,,,,,,,,,0,1,Maison,140,8,S,sols,,,160,4.084739,43.9006
2020-368736,2020-08-26,000001,Vente,168000,,,LA GARDE,B019,30260,30066,Cannes-et-Clairan,30,,,30066000AL0082,,,,,,,,,,,,,0,,,,,L,landes,PATUR,Pâture plantée,2845,4.071285,43.893763
2020-368736,2020-08-26,000001,Vente,168000,,,LA GARDE,B019,30260,30066,Cannes-et-Clairan,30,,,30066000AL0085,,,,,,,,,,,,,0,,,,,L,landes,PATUR,Pâture plantée,1265,4.072147,43.893189
2020-368736,2020-08-26,000001,Vente,168000,,,LA GARDE,B019,30260,30066,Cannes-et-Clairan,30,,,30066000AL0085,,,,,,,,,,,,,0,,,,,L,landes,PATUR,Pâture plantée,1790,4.072147,43.893189
2020-368736,2020-08-26,000001,Vente,168000,,,LES COMBES,B009,30260,30066,Cannes-et-Clairan,30,,,30066000AM0009,,,,,,,,,,,,,0,,,,,BT,taillis simples,,,5970,4.07467,43.907538
2020-368736,2020-08-26,000001,Vente,168000,,,LES COMBES,B009,30260,30066,Cannes-et-Clairan,30,,,30066000AM0053,,,,,,,,,,,,,0,,,,,BT,taillis simples,,,2860,4.070216,43.908627
2020-368736,2020-08-26,000001,Vente,168000,,,FONT DU LOUP,B017,30260,30066,Cannes-et-Clairan,30,,,30066000AM0115,,,,,,,,,,,,,0,,,,,BT,taillis simples,,,2930,4.074581,43.902664
2020-368736,2020-08-26,000001,Vente,168000,,,FONT DU LOUP,B017,30260,30066,Cannes-et-Clairan,30,,,30066000AM0116,,,,,,,,,,,,,0,,,,,BT,taillis simples,,,1987,4.075092,43.902868
2020-368736,2020-08-26,000001,Vente,168000,,,LES LAOURAS,B024,30260,30066,Cannes-et-Clairan,30,,,30066000AM0317,,,,,,,,,,,,,0,,,,,BT,taillis simples,,,1025,4.070295,43.9022
2020-368736,2020-08-26,000001,Vente,168000,,,PIED DU FAOU,B030,30260,30066,Cannes-et-Clairan,30,,,30066000AM0349,,,,,,,,,,,,,0,,,,,BT,taillis simples,,,2940,4.068192,43.905535
2020-368736,2020-08-26,000001,Vente,168000,,,PIED DU FAOU,B030,30260,30066,Cannes-et-Clairan,30,,,30066000AM0355,,,,,,,,,,,,,0,,,,,BT,taillis simples,,,18965,4.065724,43.907004
2020-368736,2020-08-26,000001,Vente,168000,,,PIED DU FAOU,B030,30260,30066,Cannes-et-Clairan,30,,,30066000AM0355,,,,,,,,,,,,,0,,,,,L,landes,PATUR,Pâture plantée,1840,4.065724,43.907004
2020-368736,2020-08-26,000001,Vente,168000,,,LA MUSCADIERE,B028,30260,30066,Cannes-et-Clairan,30,,,30066000AN0006,,,,,,,,,,,,,0,,,,,BT,taillis simples,,,5910,4.07491,43.910747
2020-368736,2020-08-26,000001,Vente,168000,,,LA MUSCADIERE,B028,30260,30066,Cannes-et-Clairan,30,,,30066000AN0101,,,,,,,,,,,,,0,,,,,BT,taillis simples,,,4595,4.080939,43.912785
2020-368736,2020-08-26,000001,Vente,168000,,,PIGNEDES,B031,30260,30066,Cannes-et-Clairan,30,,,30066000AO0086,,,,,,,,,,,,,0,,,,,L,landes,PATUR,Pâture plantée,2205,4.081523,43.916026
2020-368736,2020-08-26,000001,Vente,168000,,,PIGNEDES,B031,30260,30066,Cannes-et-Clairan,30,,,30066000AO0110,,,,,,,,,,,,,0,,,,,BT,taillis simples,,,9610,4.080822,43.914698
2020-368736,2020-08-26,000001,Vente,168000,,,PIGNEDES,B031,30260,30066,Cannes-et-Clairan,30,,,30066000AO0110,,,,,,,,,,,,,0,,,,,L,landes,PATUR,Pâture plantée,1270,4.080822,43.914698
2020-368736,2020-08-26,000001,Vente,168000,,,VALDUROLLE,B054,30260,30066,Cannes-et-Clairan,30,,,30066000AO0137,,,,,,,,,,,,,0,,,,,BT,taillis simples,,,1507,4.066126,43.910215
2020-368821,2020-09-15,000001,Vente,285000,5208,,CHE DES POUGES,0054,30260,30066,Cannes-et-Clairan,30,,,30066000AM0495,,,,,,,,,,,,,0,1,Maison,108,4,S,sols,,,500,4.079851,43.901165
2020-368821,2020-09-15,000001,Vente,285000,5208,,CHE DES POUGES,0054,30260,30066,Cannes-et-Clairan,30,,,30066000AM0495,,,,,,,,,,,,,0,1,Maison,108,4,T,terres,,,925,4.079851,43.901165
2020-369619,2020-10-12,000001,Vente,224700,5489,,LES POUGES,B042,30260,30066,Cannes-et-Clairan,30,,,30066000AM0489,,,,,,,,,,,,,0,1,Maison,104,5,S,sols,,,375,4.079948,43.900667
2020-369619,2020-10-12,000001,Vente,224700,,,RUE DES GORGUES,0025,30260,30066,Cannes-et-Clairan,30,,,30066000AM0515,,,,,,,,,,,,,0,,,,,T,terres,,,125,4.080069,43.900747
2020-370963,2020-11-30,000001,Vente,3000,,,LA GARDE,B019,30260,30066,Cannes-et-Clairan,30,,,30066000AL0066,,,,,,,,,,,,,0,,,,,L,landes,PATUR,Pâture plantée,3535,4.07805,43.895474
2020-371368,2020-12-14,000001,Vente,330000,5168,,CHE DES POUGES,0054,30260,30066,Cannes-et-Clairan,30,,,30066000AM0418,,,,,,,,,,,,,0,1,Maison,101,3,S,sols,,,500,4.07976,43.899579
2020-371368,2020-12-14,000001,Vente,330000,5168,,CHE DES POUGES,0054,30260,30066,Cannes-et-Clairan,30,,,30066000AM0418,,,,,,,,,,,,,0,1,Maison,101,3,T,terres,,,2862,4.07976,43.899579
2020-372187,2020-12-23,000001,Vente,116000,5021,,LE VILLAGE,B055,30260,30066,Cannes-et-Clairan,30,,,30066000AI0040,,,,,,,,,,,,,0,1,Maison,60,2,S,sols,,,100,4.083823,43.900747
