id_mutation,date_mutation,numero_disposition,nature_mutation,valeur_fonciere,adresse_numero,adresse_suffixe,adresse_nom_voie,adresse_code_voie,code_postal,code_commune,nom_commune,code_departement,ancien_code_commune,ancien_nom_commune,id_parcelle,ancien_id_parcelle,numero_volume,lot1_numero,lot1_surface_carrez,lot2_numero,lot2_surface_carrez,lot3_numero,lot3_surface_carrez,lot4_numero,lot4_surface_carrez,lot5_numero,lot5_surface_carrez,nombre_lots,code_type_local,type_local,surface_reelle_bati,nombre_pieces_principales,code_nature_culture,nature_culture,code_nature_culture_speciale,nature_culture_speciale,surface_terrain,longitude,latitude
2020-363204,2020-01-21,000001,Vente,250000,5252,,PUECH DU FOUR,B144,30170,30172,Monoblet,30,,,301720000C1003,,,,,,,,,,,,,0,1,Maison,120,4,BT,taillis simples,,,8212,3.92086,43.984396
2020-363204,2020-01-21,000001,Vente,250000,,,PUECH DU FOUR,B144,30170,30172,Monoblet,30,,,301720000C1004,,,,,,,,,,,,,0,,,,,VE,vergers,OLIVE,Oliveraie ou oliviers,2870,3.920612,43.984633
2020-363204,2020-01-21,000001,Vente,250000,,,PUECH DU FOUR,B144,30170,30172,Monoblet,30,,,301720000C1253,,,,,,,,,,,,,0,,,,,L,landes,PATUR,Pâture plantée,1700,3.920286,43.984717
2020-363204,2020-01-21,000001,Vente,250000,,,PUECH DU FOUR,B144,30170,30172,Monoblet,30,,,301720000C1403,,,,,,,,,,,,,0,,,,,L,landes,PATUR,Pâture plantée,671,3.920136,43.984282
2020-363204,2020-01-21,000001,Vente,250000,,,PUECH DU FOUR,B144,30170,30172,Monoblet,30,,,301720000C1406,,,,,,,,,,,,,0,,,,,L,landes,PATUR,Pâture plantée,460,3.920231,43.98409
2020-363436,2020-02-03,000001,Vente,140000,451,,ART ANC ROUTE DE SAUVE,0660,30170,30172,Monoblet,30,,,301720000C0745,,,,,,,,,,,,,0,3,Dépendance,,0,S,sols,,,880,3.890909,43.996295
2020-363436,2020-02-03,000001,Vente,140000,451,,ART ANC ROUTE DE SAUVE,0660,30170,30172,Monoblet,30,,,301720000C0745,,,,,,,,,,,,,0,1,Maison,73,3,S,sols,,,880,3.890909,43.996295
2020-363436,2020-02-03,000001,Vente,140000,451,,ART ANC ROUTE DE SAUVE,0660,30170,30172,Monoblet,30,,,301720000C0745,,,,,,,,,,,,,0,3,Dépendance,,0,T,terres,,,1718,3.890909,43.996295
2020-363436,2020-02-03,000001,Vente,140000,451,,ART ANC ROUTE DE SAUVE,0660,30170,30172,Monoblet,30,,,301720000C0745,,,,,,,,,,,,,0,1,Maison,73,3,T,terres,,,1718,3.890909,43.996295
2020-364050,2020-02-06,000002,Vente,25000,,,LES SIEGES,B173,30170,30172,Monoblet,30,,,301720000C1936,,,,,,,,,,,,,0,,,,,L,landes,PATUR,Pâture plantée,994,3.889307,43.996304
2020-365137,2020-02-24,000001,Vente,195000,5351,,BLANQUIER,B018,30170,30172,Monoblet,30,,,301720000A0130,,,,,,,,,,,,,0,1,Maison,97,3,S,sols,,,56,3.850041,44.012016
2020-365137,2020-02-24,000001,Vente,195000,,,GALARY,B062,30170,30172,Monoblet,30,,,301720000A0500,,,,,,,,,,,,,0,,,,,T,terres,,,985,3.849962,44.011885
2020-365137,2020-02-24,000001,Vente,195000,,,BLANQUIER,B018,30170,30172,Monoblet,30,,,301720000A0502,,,,,,,,,,,,,0,,,,,S,sols,,,11,3.85012,44.012037
2020-365246,2020-04-17,000001,Vente,225000,,,CAP DE LA MONTADE,B039,30170,30172,Monoblet,30,,,301720000C0213,,,,,,,,,,,,,0,,,,,VE,vergers,OLIVE,Oliveraie ou oliviers,3275,3.879868,43.99772
2020-365246,2020-04-17,000001,Vente,225000,214,,RTE DE VERDEILLE,0740,30170,30172,Monoblet,30,,,301720000C0214,,,,,,,,,,,,,0,1,Maison,100,4,S,sols,,,1337,3.880148,43.997199
2020-365246,2020-04-17,000001,Vente,225000,,,CAP DE LA MONTADE,B039,30170,30172,Monoblet,30,,,301720000C0215,,,,,,,,,,,,,0,,,,,L,landes,PATUR,Pâture plantée,1780,3.879618,43.997288
2020-365246,2020-04-17,000001,Vente,225000,,,CAP DE LA MONTADE,B039,30170,30172,Monoblet,30,,,301720000C0216,,,,,,,,,,,,,0,,,,,VI,vignes,,,4020,3.879783,43.996806
2020-365246,2020-04-17,000001,Vente,225000,,,CAP DE LA MONTADE,B039,30170,30172,Monoblet,30,,,301720000C0217,,,,,,,,,,,,,0,,,,,T,terres,,,600,3.879702,43.996341
2020-365246,2020-04-17,000001,Vente,225000,,,CAP DE LA MONTADE,B039,30170,30172,Monoblet,30,,,301720000C0225,,,,,,,,,,,,,0,,,,,L,landes,PATUR,Pâture plantée,2950,3.880015,43.996463
2020-365246,2020-04-17,000001,Vente,225000,,,CAP DE LA MONTADE,B039,30170,30172,Monoblet,30,,,301720000C0226,,,,,,,,,,,,,0,,,,,L,landes,PATUR,Pâture plantée,930,3.880373,43.997378
2020-365703,2020-05-20,000002,Vente,60000,,,LE VILLAGE,B185,30170,30172,Monoblet,30,,,30172000AB0380,,,,,,,,,,,,,0,,,,,L,landes,PATUR,Pâture plantée,750,3.884638,44.000252
2020-365810,2020-05-25,000001,Vente,170000,,,LA BOISSIERE,B021,30170,30172,Monoblet,30,,,301720000C0751,,,,,,,,,,,,,0,,,,,T,terres,,,2186,3.893622,43.996005
2020-365810,2020-05-25,000001,Vente,170000,,,LA BOISSIERE,B021,30170,30172,Monoblet,30,,,301720000C0752,,,,,,,,,,,,,0,,,,,T,terres,,,1037,3.893911,43.995493
2020-365810,2020-05-25,000001,Vente,170000,,,LA BOISSIERE,B021,30170,30172,Monoblet,30,,,301720000C0752,,,,,,,,,,,,,0,,,,,T,terres,,,350,3.893911,43.995493
2020-365810,2020-05-25,000001,Vente,170000,,,LA BOISSIERE,B021,30170,30172,Monoblet,30,,,301720000C0752,,,,,,,,,,,,,0,,,,,T,terres,,,1000,3.893911,43.995493
2020-365810,2020-05-25,000001,Vente,170000,,,LA BOISSIERE,B021,30170,30172,Monoblet,30,,,301720000C0754,,,,,,,,,,,,,0,,,,,T,terres,,,50,3.894307,43.995534
2020-365810,2020-05-25,000001,Vente,170000,,,LA BOISSIERE,B021,30170,30172,Monoblet,30,,,301720000C0754,,,,,,,,,,,,,0,,,,,T,terres,,,1930,3.894307,43.995534
2020-365810,2020-05-25,000001,Vente,170000,419,,ART ANC ROUTE DE SAUVE,0660,30170,30172,Monoblet,30,,,301720000C0755,,,,,,,,,,,,,0,,,,,S,sols,,,14,3.894379,43.995973
2020-365810,2020-05-25,000001,Vente,170000,419,,ART ANC ROUTE DE SAUVE,0660,30170,30172,Monoblet,30,,,301720000C0756,,,,,,,,,,,,,0,1,Maison,92,2,S,sols,,,500,3.894519,43.995817
2020-365810,2020-05-25,000001,Vente,170000,419,,ART ANC ROUTE DE SAUVE,0660,30170,30172,Monoblet,30,,,301720000C0756,,,,,,,,,,,,,0,1,Maison,92,2,T,terres,,,936,3.894519,43.995817
2020-365810,2020-05-25,000001,Vente,170000,419,,ART ANC ROUTE DE SAUVE,0660,30170,30172,Monoblet,30,,,301720000C0756,,,,,,,,,,,,,0,1,Maison,92,2,T,terres,,,1000,3.894519,43.995817
2020-365810,2020-05-25,000001,Vente,170000,,,LA BOISSIERE,B021,30170,30172,Monoblet,30,,,301720000C0757,,,,,,,,,,,,,0,,,,,S,sols,,,16,3.894795,43.995535
2020-365810,2020-05-25,000001,Vente,170000,,,LA BOISSIERE,B021,30170,30172,Monoblet,30,,,301720000C0758,,,,,,,,,,,,,0,,,,,T,terres,,,1484,3.895012,43.995565
2020-365810,2020-05-25,000001,Vente,170000,,,LA BOISSIERE,B021,30170,30172,Monoblet,30,,,301720000C0758,,,,,,,,,,,,,0,,,,,T,terres,,,3000,3.895012,43.995565
2020-365810,2020-05-25,000001,Vente,170000,,,LA BOISSIERE,B021,30170,30172,Monoblet,30,,,301720000C0759,,,,,,,,,,,,,0,,,,,BT,taillis simples,,,4430,3.894885,43.996076
2020-366047,2020-06-11,000001,Vente,320000,,,TERRE D AUZILLON,B175,30170,30172,Monoblet,30,,,301720000A0015,,,,,,,,,,,,,0,,,,,VE,vergers,CHAT,Châtaigneraie,2200,3.836663,44.022845
2020-366047,2020-06-11,000001,Vente,320000,,,TERRE D AUZILLON,B175,30170,30172,Monoblet,30,,,301720000A0016,,,,,,,,,,,,,0,,,,,VE,vergers,CHAT,Châtaigneraie,3280,3.836975,44.022715
2020-366047,2020-06-11,000001,Vente,320000,,,TERRE D AUZILLON,B175,30170,30172,Monoblet,30,,,301720000A0017,,,,,,,,,,,,,0,,,,,VI,vignes,,,1760,3.837326,44.022956
2020-366047,2020-06-11,000001,Vente,320000,,,TERRE D AUZILLON,B175,30170,30172,Monoblet,30,,,301720000A0018,,,,,,,,,,,,,0,,,,,T,terres,,,1560,3.837559,44.022674
2020-366047,2020-06-11,000001,Vente,320000,,,TERRE D AUZILLON,B175,30170,30172,Monoblet,30,,,301720000A0019,,,,,,,,,,,,,0,,,,,L,landes,PATUR,Pâture plantée,2520,3.837958,44.022946
2020-366047,2020-06-11,000001,Vente,320000,,,TERRE D AUZILLON,B175,30170,30172,Monoblet,30,,,301720000A0020,,,,,,,,,,,,,0,,,,,L,landes,PATUR,Pâture plantée,660,3.838399,44.022752
2020-366047,2020-06-11,000001,Vente,320000,,,TERRE D AUZILLON,B175,30170,30172,Monoblet,30,,,301720000A0021,,,,,,,,,,,,,0,,,,,VE,vergers,CHAT,Châtaigneraie,12636,3.839304,44.02263
2020-366058,2020-06-08,000001,Vente,25000,,,PERACHE,B116,30170,30172,Monoblet,30,,,301720000C0442,,,,,,,,,,,,,0,,,,,P,prés,,,1230,3.892221,43.988027
2020-366058,2020-06-08,000001,Vente,25000,,,PERACHE,B116,30170,30172,Monoblet,30,,,301720000C0443,,,,,,,,,,,,,0,,,,,BT,taillis simples,,,2310,3.892248,43.988189
2020-366058,2020-06-08,000001,Vente,25000,,,PERACHE,B116,30170,30172,Monoblet,30,,,301720000C0445,,,,,,,,,,,,,0,,,,,J,jardins,POTAG,Jardin potager,350,3.891574,43.988461
2020-366373,2020-06-11,000001,Vente,2500,,,LE VIALA,B184,30170,30172,Monoblet,30,,,301720000D0100,,,,,,,,,,,,,0,,,,,S,sols,,,89,3.881926,43.984426
2020-366373,2020-06-11,000001,Vente,2500,,,LE VIALA,B184,30170,30172,Monoblet,30,,,301720000D0101,,,,,,,,,,,,,0,,,,,BT,taillis simples,,,2170,3.881786,43.984585
2020-366373,2020-06-11,000001,Vente,2500,,,LE VIALA,B184,30170,30172,Monoblet,30,,,301720000D0267,,,,,,,,,,,,,0,,,,,L,landes,PATUR,Pâture plantée,2650,3.88158,43.984264
2020-366779,2020-06-19,000001,Vente,251790,100,,CHE DU SERRE,0680,30170,30172,Monoblet,30,,,301720000C0235,,,,,,,,,,,,,0,1,Maison,70,3,L,landes,PATUR,Pâture plantée,3090,3.882931,43.997234
2020-366779,2020-06-19,000001,Vente,251790,100,,CHE DU SERRE,0680,30170,30172,Monoblet,30,,,301720000C0235,,,,,,,,,,,,,0,1,Maison,70,3,S,sols,,,1000,3.882931,43.997234
2020-367414,2020-07-27,000001,Vente,250000,,,LA BOISSIERE,B021,30170,30172,Monoblet,30,,,301720000C1674,,,,,,,,,,,,,0,,,,,T,terres,,,201,3.890799,43.996998
2020-367414,2020-07-27,000001,Vente,250000,421,,ART ANC ROUTE DE SAUVE,0660,30170,30172,Monoblet,30,,,301720000C1953,,,,,,,,,,,,,0,1,Maison,96,4,S,sols,,,2000,3.891241,43.996838
2020-367414,2020-07-27,000001,Vente,250000,421,,ART ANC ROUTE DE SAUVE,0660,30170,30172,Monoblet,30,,,301720000C1953,,,,,,,,,,,,,0,1,Maison,96,4,BT,taillis simples,,,7941,3.891241,43.996838
2020-367414,2020-07-27,000001,Vente,250000,,,LA BOISSIERE,B021,30170,30172,Monoblet,30,,,301720000C1958,,,,,,,,,,,,,0,,,,,T,terres,,,17,3.890899,43.996537
2020-367600,2020-07-23,000001,Vente,70000,,,LA ROUVIERE,B162,30170,30172,Monoblet,30,,,301720000B0984,,,,,,,,,,,,,0,,,,,L,landes,PATUR,Pâture plantée,7,3.866829,44.008993
2020-367600,2020-07-23,000001,Vente,70000,,,LA ROUVIERE,B162,30170,30172,Monoblet,30,,,301720000B1011,,,,,,,,,,,,,0,,,,,T,terres,,,1061,3.866833,44.009261
2020-367600,2020-07-23,000001,Vente,70000,,,LA ROUVIERE,B162,30170,30172,Monoblet,30,,,301720000B1016,,,,,,,,,,,,,0,,,,,L,landes,PATUR,Pâture plantée,272,3.866915,44.009091
2020-368240,2020-08-07,000001,Vente,69810,,,LA PAUSE,B114,30170,30172,Monoblet,30,,,30172000AB0376,,,,,,,,,,,,,0,,,,,VI,vignes,,,1074,3.883111,43.997831
2020-368402,2020-08-18,000001,Vente,468500,196,,RUE DE L'ESTRANGLADOU,0200,30170,30172,Monoblet,30,,,301720000A0504,,,,,,,,,,,,,0,1,Maison,175,5,S,sols,,,500,3.852448,44.013916
2020-368402,2020-08-18,000001,Vente,468500,196,,RUE DE L'ESTRANGLADOU,0200,30170,30172,Monoblet,30,,,301720000A0504,,,,,,,,,,,,,0,1,Maison,175,5,VE,vergers,CHAT,Châtaigneraie,1493,3.852448,44.013916
2020-368402,2020-08-18,000001,Vente,468500,,,VALESTALIERE,B180,30170,30172,Monoblet,30,,,301720000A0506,,,,,,,,,,,,,0,,,,,VE,vergers,CHAT,Châtaigneraie,4357,3.851948,44.012871
2020-368448,2020-09-07,000001,Vente,165182,727,,RTE DE LA CABANELLE,0060,30170,30172,Monoblet,30,,,301720000C1839,,,,,,,,,,,,,0,1,Maison,92,5,S,sols,,,708,3.894182,44.00449
2020-369746,2020-10-08,000002,Vente,73300,,,LA ROUVIERE,B162,30170,30172,Monoblet,30,,,301720000B1019,,,,,,,,,,,,,0,,,,,VI,vignes,,,1466,3.865873,44.008998
2020-369748,2020-10-08,000001,Vente,75250,,,LA ROUVIERE,B162,30170,30172,Monoblet,30,,,301720000B1018,,,,,,,,,,,,,0,,,,,VI,vignes,,,1505,3.86604,44.009153
2020-371199,2020-10-29,000001,Vente,2200,,,PONT DE RIBOU,B131,30170,30172,Monoblet,30,,,301720000C0063,,,,,,,,,,,,,0,,,,,T,terres,,,1380,3.900836,44.01077
2020-371199,2020-10-29,000001,Vente,2200,,,PONT DE RIBOU,B131,30170,30172,Monoblet,30,,,301720000C0064,,,,,,,,,,,,,0,,,,,T,terres,,,790,3.901191,44.01047
2020-371520,2020-11-19,000001,Vente,70000,,,LA ROUVIERE,B162,30170,30172,Monoblet,30,,,301720000B1013,,,,,,,,,,,,,0,,,,,T,terres,,,512,3.866378,44.009105
2020-371520,2020-11-19,000001,Vente,70000,,,LA ROUVIERE,B162,30170,30172,Monoblet,30,,,301720000B1014,,,,,,,,,,,,,0,,,,,L,landes,PATUR,Pâture plantée,854,3.866428,44.008928
2020-371554,2020-12-02,000001,Vente,132000,727,,RTE DE LA CABANELLE,0060,30170,30172,Monoblet,30,,,301720000C1835,,,,,,,,,,,,,0,1,Maison,90,4,S,sols,,,762,3.893293,44.004436
2020-371563,2020-12-18,000002,Vente,7000,,,VALESTALIERE,B180,30170,30172,Monoblet,30,,,301720000A0532,,,,,,,,,,,,,0,,,,,BT,taillis simples,CHAT,Châtaigneraie,1492,3.85112,44.014104
2020-371630,2020-12-02,000001,Vente,736500,,,LES BAUX,B014,30170,30172,Monoblet,30,,,301720000C1067,,,,,,,,,,,,,0,,,,,P,prés,,,1280,3.920972,43.981288
2020-371630,2020-12-02,000001,Vente,736500,,,LES BAUX,B014,30170,30172,Monoblet,30,,,301720000C1068,,,,,,,,,,,,,0,,,,,T,terres,,,1944,3.920786,43.981115
2020-371630,2020-12-02,000001,Vente,736500,5117,,LES BAUX,B014,30170,30172,Monoblet,30,,,301720000C1069,,,,,,,,,,,,,0,1,Maison,165,6,S,sols,,,556,3.920746,43.980762
2020-371630,2020-12-02,000001,Vente,736500,,,LES BAUX,B014,30170,30172,Monoblet,30,,,301720000C1070,,,,,,,,,,,,,0,,,,,T,terres,,,2776,3.920342,43.980885
2020-371630,2020-12-02,000001,Vente,736500,,,LES BAUX,B014,30170,30172,Monoblet,30,,,301720000C1079,,,,,,,,,,,,,0,,,,,L,landes,PATUR,Pâture plantée,1785,3.920106,43.980806
2020-372093,2020-12-10,000001,Vente,68500,,,LES JONQUAS,B083,30170,30172,Monoblet,30,,,301720000C1875,,,,,,,,,,,,,0,,,,,T,terres,,,1713,,
2020-372247,2020-12-15,000001,Vente,75000,,,LA ROUVIERE,B162,30170,30172,Monoblet,30,,,301720000B0976,,,,,,,,,,,,,0,,,,,L,landes,PATUR,Pâture plantée,927,3.867215,44.009542
2020-372247,2020-12-15,000001,Vente,75000,,,LA ROUVIERE,B162,30170,30172,Monoblet,30,,,301720000B0977,,,,,,,,,,,,,0,,,,,L,landes,PATUR,Pâture plantée,702,3.867187,44.009278
