id_mutation,date_mutation,numero_disposition,nature_mutation,valeur_fonciere,adresse_numero,adresse_suffixe,adresse_nom_voie,adresse_code_voie,code_postal,code_commune,nom_commune,code_departement,ancien_code_commune,ancien_nom_commune,id_parcelle,ancien_id_parcelle,numero_volume,lot1_numero,lot1_surface_carrez,lot2_numero,lot2_surface_carrez,lot3_numero,lot3_surface_carrez,lot4_numero,lot4_surface_carrez,lot5_numero,lot5_surface_carrez,nombre_lots,code_type_local,type_local,surface_reelle_bati,nombre_pieces_principales,code_nature_culture,nature_culture,code_nature_culture_speciale,nature_culture_speciale,surface_terrain,longitude,latitude
2020-363583,2020-01-31,000001,Vente,230000,174,,CHE DE SAINT GENIES,0113,30730,30281,Saint-Mamert-du-Gard,30,,,302810000B2206,,,,,,,,,,,,,0,1,Maison,103,4,S,sols,,,800,4.191811,43.889821
2020-363693,2020-01-31,000001,Vente,231950,34,,CHE DES COURSES,0041,30730,30281,Saint-Mamert-du-Gard,30,,,302810000B2433,,,,,,,,,,,,,0,1,Maison,90,3,S,sols,,,758,4.193996,43.890565
2020-363992,2020-02-11,000001,Vente,96000,,,ROBIAC,B109,30730,30281,Saint-Mamert-du-Gard,30,,,302810000A0164,,,,,,,,,,,,,0,,,,,VI,vignes,,,1177,4.159396,43.891771
2020-363992,2020-02-11,000001,Vente,96000,,,TERRES DE JEANNE,B123,30730,30281,Saint-Mamert-du-Gard,30,,,302810000A0172,,,,,,,,,,,,,0,,,,,T,terres,,,3710,4.159142,43.89078
2020-363992,2020-02-11,000001,Vente,96000,,,TERRES DE JEANNE,B123,30730,30281,Saint-Mamert-du-Gard,30,,,302810000A0173,,,,,,,,,,,,,0,,,,,T,terres,,,1495,4.159466,43.891236
2020-363992,2020-02-11,000001,Vente,96000,,,TERRES DE JEANNE,B123,30730,30281,Saint-Mamert-du-Gard,30,,,302810000A0174,,,,,,,,,,,,,0,,,,,T,terres,,,3850,4.15888,43.891321
2020-363992,2020-02-11,000001,Vente,96000,,,TERRES DE JEANNE,B123,30730,30281,Saint-Mamert-du-Gard,30,,,302810000A0175,,,,,,,,,,,,,0,,,,,VI,vignes,,,867,4.159093,43.891822
2020-363992,2020-02-11,000001,Vente,96000,,,TERRES DE JEANNE,B123,30730,30281,Saint-Mamert-du-Gard,30,,,302810000A0175,,,,,,,,,,,,,0,,,,,VI,vignes,,,943,4.159093,43.891822
2020-363992,2020-02-11,000001,Vente,96000,,,TERRES DE JEANNE,B123,30730,30281,Saint-Mamert-du-Gard,30,,,302810000A0176,,,,,,,,,,,,,0,,,,,VI,vignes,,,6130,4.158391,43.891781
2020-363992,2020-02-11,000001,Vente,96000,,,TERRES DE JEANNE,B123,30730,30281,Saint-Mamert-du-Gard,30,,,302810000A0177,,,,,,,,,,,,,0,,,,,VI,vignes,,,555,4.157642,43.891878
2020-363992,2020-02-11,000001,Vente,96000,,,TERRES DE JEANNE,B123,30730,30281,Saint-Mamert-du-Gard,30,,,302810000A0178,,,,,,,,,,,,,0,,,,,VI,vignes,,,830,4.157381,43.891892
2020-363992,2020-02-11,000001,Vente,96000,,,TERRES DE JEANNE,B123,30730,30281,Saint-Mamert-du-Gard,30,,,302810000A0179,,,,,,,,,,,,,0,,,,,VI,vignes,,,2010,4.157407,43.892162
2020-363992,2020-02-11,000001,Vente,96000,,,TERRES DE JEANNE,B123,30730,30281,Saint-Mamert-du-Gard,30,,,302810000A0180,,,,,,,,,,,,,0,,,,,VI,vignes,,,6315,4.156644,43.892172
2020-363992,2020-02-11,000001,Vente,96000,,,TERRES DE JEANNE,B123,30730,30281,Saint-Mamert-du-Gard,30,,,302810000A0181,,,,,,,,,,,,,0,,,,,T,terres,,,2940,4.15681,43.891407
2020-363992,2020-02-11,000001,Vente,96000,,,TERRES DE JEANNE,B123,30730,30281,Saint-Mamert-du-Gard,30,,,302810000A0182,,,,,,,,,,,,,0,,,,,T,terres,,,1690,4.157208,43.890943
2020-363992,2020-02-11,000001,Vente,96000,,,TERRES DE JEANNE,B123,30730,30281,Saint-Mamert-du-Gard,30,,,302810000A0183,,,,,,,,,,,,,0,,,,,T,terres,,,6965,4.157779,43.891359
2020-363992,2020-02-11,000001,Vente,96000,,,TERRES DE JEANNE,B123,30730,30281,Saint-Mamert-du-Gard,30,,,302810000A0184,,,,,,,,,,,,,0,,,,,T,terres,,,6010,4.15804,43.890775
2020-363992,2020-02-11,000001,Vente,96000,,,TERRES DE JEANNE,B123,30730,30281,Saint-Mamert-du-Gard,30,,,302810000A0185,,,,,,,,,,,,,0,,,,,T,terres,,,3780,4.158976,43.890319
2020-363992,2020-02-11,000001,Vente,96000,,,TERRES DE JEANNE,B123,30730,30281,Saint-Mamert-du-Gard,30,,,302810000A0187,,,,,,,,,,,,,0,,,,,L,landes,,,9180,4.159073,43.889881
2020-363992,2020-02-11,000001,Vente,96000,,,TERRES DE JEANNE,B123,30730,30281,Saint-Mamert-du-Gard,30,,,302810000A0188,,,,,,,,,,,,,0,,,,,T,terres,,,5820,4.158079,43.889934
2020-363992,2020-02-11,000001,Vente,96000,,,TERRES DE JEANNE,B123,30730,30281,Saint-Mamert-du-Gard,30,,,302810000A0192,,,,,,,,,,,,,0,,,,,VI,vignes,,,3600,4.157821,43.88943
2020-363992,2020-02-11,000001,Vente,96000,,,TERRES DE JEANNE,B123,30730,30281,Saint-Mamert-du-Gard,30,,,302810000A0193,,,,,,,,,,,,,0,,,,,VI,vignes,,,3670,4.159149,43.889181
2020-363992,2020-02-11,000001,Vente,96000,,,LE BERIER,B007,30730,30281,Saint-Mamert-du-Gard,30,,,302810000A0194,,,,,,,,,,,,,0,,,,,VI,vignes,,,2520,4.157726,43.889164
2020-363992,2020-02-11,000001,Vente,96000,,,LE BERIER,B007,30730,30281,Saint-Mamert-du-Gard,30,,,302810000A0195,,,,,,,,,,,,,0,,,,,VI,vignes,,,3680,4.157602,43.888944
2020-363992,2020-02-11,000001,Vente,96000,,,LE BERIER,B007,30730,30281,Saint-Mamert-du-Gard,30,,,302810000A0197,,,,,,,,,,,,,0,,,,,VI,vignes,,,2470,4.157195,43.888643
2020-363992,2020-02-11,000001,Vente,96000,,,LE BERIER,B007,30730,30281,Saint-Mamert-du-Gard,30,,,302810000A0198,,,,,,,,,,,,,0,,,,,VI,vignes,,,1460,4.157196,43.888353
2020-363992,2020-02-11,000001,Vente,96000,,,LE BERIER,B007,30730,30281,Saint-Mamert-du-Gard,30,,,302810000A0199,,,,,,,,,,,,,0,,,,,VI,vignes,,,3430,4.157009,43.887952
2020-363992,2020-02-11,000001,Vente,96000,,,LE BERIER,B007,30730,30281,Saint-Mamert-du-Gard,30,,,302810000A0200,,,,,,,,,,,,,0,,,,,VI,vignes,,,3800,4.157852,43.887997
2020-364508,2020-02-24,000001,Vente,295000,,,LE VILLAGE,B129,30730,30281,Saint-Mamert-du-Gard,30,,,302810000B0731,,,,,,,,,,,,,0,,,,,S,sols,,,28,4.189815,43.886618
2020-364508,2020-02-24,000001,Vente,295000,10,,IMP DE LA CALADE,0030,30730,30281,Saint-Mamert-du-Gard,30,,,302810000B0734,,,,,,,,,,,,,0,1,Maison,140,5,S,sols,,,205,4.189896,43.886518
2020-364508,2020-02-24,000001,Vente,295000,,,LE VILLAGE,B129,30730,30281,Saint-Mamert-du-Gard,30,,,302810000B1713,,,,,,,,,,,,,0,,,,,S,sols,,,13,4.189871,43.886589
2020-364508,2020-02-24,000001,Vente,295000,,,LE VILLAGE,B129,30730,30281,Saint-Mamert-du-Gard,30,,,302810000B1806,,,,,,,,,,,,,0,,,,,T,terres,,,157,4.190038,43.886362
2020-364508,2020-02-24,000001,Vente,295000,,,LE VILLAGE,B129,30730,30281,Saint-Mamert-du-Gard,30,,,302810000B1809,,,,,,,,,,,,,0,,,,,S,sols,,,120,4.189967,43.886578
2020-365141,2020-04-16,000001,Vente,47000,3,,IMP DU MAQUISARD,0082,30730,30281,Saint-Mamert-du-Gard,30,,,302810000B0620,,,,,,,,,,,,,0,1,Maison,42,1,S,sols,,,29,4.188426,43.887309
2020-365266,2020-04-29,000001,Vente,75000,5356,,CHE DE COMBAS,0040,30730,30281,Saint-Mamert-du-Gard,30,,,302810000B2332,,,,,,,,,,,,,0,,,,,AB,terrains a bâtir,,,365,4.185395,43.886085
2020-365284,2020-04-20,000001,Vente,270000,59,,CHE DES COURSES,0041,30730,30281,Saint-Mamert-du-Gard,30,,,302810000B1704,,,,,,,,,,,,,0,1,Maison,145,6,S,sols,,,500,4.193543,43.890755
2020-365284,2020-04-20,000001,Vente,270000,59,,CHE DES COURSES,0041,30730,30281,Saint-Mamert-du-Gard,30,,,302810000B1704,,,,,,,,,,,,,0,1,Maison,145,6,T,terres,,,800,4.193543,43.890755
2020-365622,2020-05-13,000001,Vente,15000,,,BAS MONTAGNON,B004,30730,30281,Saint-Mamert-du-Gard,30,,,302810000C0527,,,,,,,,,,,,,0,,,,,T,terres,,,7000,4.185473,43.875519
2020-365622,2020-05-13,000001,Vente,15000,,,HAUT MONTAGNON,B080,30730,30281,Saint-Mamert-du-Gard,30,,,302810000C0783,,,,,,,,,,,,,0,,,,,T,terres,,,4220,4.187116,43.870891
2020-366156,2020-05-28,000001,Vente,186500,3,,RUE DU CRES,0042,30730,30281,Saint-Mamert-du-Gard,30,,,302810000B1484,,,,,,,,,,,,,0,1,Maison,73,3,S,sols,,,583,4.191162,43.885721
2020-366290,2020-06-02,000001,Vente,287000,3,,PL DE L EGLISE,0056,30730,30281,Saint-Mamert-du-Gard,30,,,302810000B1920,,,,,,,,,,,,,0,1,Maison,125,5,S,sols,,,170,4.189656,43.88698
2020-367507,2020-07-06,000002,Vente,2000,102,,CHE DE ROBIAC,0111,30730,30281,Saint-Mamert-du-Gard,30,,,302810000B2620,,,,,,,,,,,,,0,1,Maison,115,4,S,sols,,,141,,
2020-367625,2020-07-27,000001,Vente,89000,,,FRANCURELLE,B069,30730,30281,Saint-Mamert-du-Gard,30,,,302810000B1556,,,,,,,,,,,,,0,,,,,S,sols,,,326,4.190174,43.892266
2020-367625,2020-07-27,000001,Vente,89000,,,FRANCURELLE,B069,30730,30281,Saint-Mamert-du-Gard,30,,,302810000B2489,,,,,,,,,,,,,0,,,,,T,terres,,,470,4.189825,43.892202
2020-368170,2020-08-20,000001,Vente,337863,2,,IMP DES OLIVIERS,0096,30730,30281,Saint-Mamert-du-Gard,30,,,302810000B2112,,,,,,,,,,,,,0,1,Maison,143,6,S,sols,,,760,4.188957,43.890743
2020-368175,2020-07-02,000002,Vente,16300,,,CHEMIN DE LA CALMETTE,B037,30730,30281,Saint-Mamert-du-Gard,30,,,302810000B2172,,,,,,,,,,,,,0,,,,,L,landes,,,79,4.195733,43.891318
2020-368527,2020-08-29,000001,Vente,210200,206,,CHE DE GAJANE,0064,30730,30281,Saint-Mamert-du-Gard,30,,,302810000B2160,,,,,,,,,,,,,0,1,Maison,112,3,S,sols,,,471,4.194804,43.889141
2020-368719,2020-08-25,000001,Vente,225000,269,,RUE DE CARRIERE CROSE,0028,30730,30281,Saint-Mamert-du-Gard,30,,,302810000C0236,,,,,,,,,,,,,0,1,Maison,98,4,T,terres,,,1440,4.186304,43.883875
2020-368950,2020-09-21,000001,Vente,85980,20,,RTE DE NIMES,0095,30730,30281,Saint-Mamert-du-Gard,30,,,302810000B1837,,,1,31.69,,,,,,,,,1,2,Appartement,35,2,,,,,,4.188779,43.886893
2020-370389,2020-11-05,000001,Vente,333400,4,,RUE DE LA GALINIERE,0065,30730,30281,Saint-Mamert-du-Gard,30,,,302810000B0590,,,,,,,,,,,,,0,1,Maison,347,11,S,sols,,,915,4.18768,43.887976
2020-370389,2020-11-05,000001,Vente,333400,,,LE VILLAGE,B129,30730,30281,Saint-Mamert-du-Gard,30,,,302810000B0591,,,,,,,,,,,,,0,,,,,J,jardins,POTAG,Jardin potager,610,4.187513,43.887783
2020-370578,2020-10-27,000001,Vente,26360,,,TERRES DE HOUMES,B122,30730,30281,Saint-Mamert-du-Gard,30,,,302810000A0211,,,,,,,,,,,,,0,,,,,VI,vignes,,,1240,4.16272,43.891345
2020-370578,2020-10-27,000001,Vente,26360,,,TERRES DE HOUMES,B122,30730,30281,Saint-Mamert-du-Gard,30,,,302810000A0212,,,,,,,,,,,,,0,,,,,VI,vignes,,,240,4.1624,43.891131
2020-370578,2020-10-27,000001,Vente,26360,,,TERRES DE HOUMES,B122,30730,30281,Saint-Mamert-du-Gard,30,,,302810000A0213,,,,,,,,,,,,,0,,,,,VI,vignes,,,350,4.162376,43.891006
2020-370578,2020-10-27,000001,Vente,26360,,,TERRES DE HOUMES,B122,30730,30281,Saint-Mamert-du-Gard,30,,,302810000A0214,,,,,,,,,,,,,0,,,,,VI,vignes,,,12,4.162554,43.891107
2020-370578,2020-10-27,000001,Vente,26360,,,TERRES DE HOUMES,B122,30730,30281,Saint-Mamert-du-Gard,30,,,302810000A0214,,,,,,,,,,,,,0,,,,,VI,vignes,,,74,4.162554,43.891107
2020-370578,2020-10-27,000001,Vente,26360,,,TERRES DE HOUMES,B122,30730,30281,Saint-Mamert-du-Gard,30,,,302810000A0214,,,,,,,,,,,,,0,,,,,VI,vignes,,,12,4.162554,43.891107
2020-370578,2020-10-27,000001,Vente,26360,,,TERRES DE HOUMES,B122,30730,30281,Saint-Mamert-du-Gard,30,,,302810000A0214,,,,,,,,,,,,,0,,,,,VI,vignes,,,12,4.162554,43.891107
2020-370578,2020-10-27,000001,Vente,26360,,,TERRES DE HOUMES,B122,30730,30281,Saint-Mamert-du-Gard,30,,,302810000A0219,,,,,,,,,,,,,0,,,,,VI,vignes,,,1220,4.162416,43.890024
2020-370578,2020-10-27,000001,Vente,26360,,,TERRES DE HOUMES,B122,30730,30281,Saint-Mamert-du-Gard,30,,,302810000A0220,,,,,,,,,,,,,0,,,,,VI,vignes,,,6190,4.16176,43.890404
2020-370578,2020-10-27,000001,Vente,26360,,,TERRES DE HOUMES,B122,30730,30281,Saint-Mamert-du-Gard,30,,,302810000A0221,,,,,,,,,,,,,0,,,,,T,terres,,,5760,4.161504,43.889792
2020-370578,2020-10-27,000001,Vente,26360,,,TERRES DE HOUMES,B122,30730,30281,Saint-Mamert-du-Gard,30,,,302810000A0221,,,,,,,,,,,,,0,,,,,VI,vignes,,,600,4.161504,43.889792
2020-370578,2020-10-27,000001,Vente,26360,,,TERRES DE HOUMES,B122,30730,30281,Saint-Mamert-du-Gard,30,,,302810000A0225,,,,,,,,,,,,,0,,,,,T,terres,,,330,4.161999,43.889054
2020-370578,2020-10-27,000001,Vente,26360,,,TERRES DE HOUMES,B122,30730,30281,Saint-Mamert-du-Gard,30,,,302810000A0225,,,,,,,,,,,,,0,,,,,VI,vignes,,,1100,4.161999,43.889054
2020-370578,2020-10-27,000001,Vente,26360,,,TERRES DE HOUMES,B122,30730,30281,Saint-Mamert-du-Gard,30,,,302810000A0226,,,,,,,,,,,,,0,,,,,T,terres,,,4250,4.161039,43.889429
2020-370578,2020-10-27,000001,Vente,26360,,,TERRES DE HOUMES,B122,30730,30281,Saint-Mamert-du-Gard,30,,,302810000A0227,,,,,,,,,,,,,0,,,,,VI,vignes,,,500,4.161435,43.888913
2020-370578,2020-10-27,000001,Vente,26360,,,TERRES DE HOUMES,B122,30730,30281,Saint-Mamert-du-Gard,30,,,302810000A0227,,,,,,,,,,,,,0,,,,,T,terres,,,2390,4.161435,43.888913
2020-370578,2020-10-27,000001,Vente,26360,,,PLAINE VERTE,B092,30730,30281,Saint-Mamert-du-Gard,30,,,302810000A0893,,,,,,,,,,,,,0,,,,,VI,vignes,,,2555,4.163449,43.891256
2020-370578,2020-10-27,000001,Vente,26360,,,PLAINE VERTE,B092,30730,30281,Saint-Mamert-du-Gard,30,,,302810000A0895,,,,,,,,,,,,,0,,,,,VI,vignes,,,480,4.163176,43.891226
2020-370578,2020-10-27,000001,Vente,26360,,,TERRES DE HOUMES,B122,30730,30281,Saint-Mamert-du-Gard,30,,,302810000A0896,,,,,,,,,,,,,0,,,,,VI,vignes,,,3400,4.162919,43.891052
2020-370578,2020-10-27,000001,Vente,26360,,,TERRES DE HOUMES,B122,30730,30281,Saint-Mamert-du-Gard,30,,,302810000A0898,,,,,,,,,,,,,0,,,,,VI,vignes,,,4431,4.162424,43.890639
2020-370578,2020-10-27,000001,Vente,26360,,,TERRES DE HOUMES,B122,30730,30281,Saint-Mamert-du-Gard,30,,,302810000A0900,,,,,,,,,,,,,0,,,,,VI,vignes,,,211,4.162747,43.891043
2020-370742,2020-11-19,000002,Vente,80000,,,LE VILLAGE,B129,30730,30281,Saint-Mamert-du-Gard,30,,,302810000B2493,,,,,,,,,,,,,0,,,,,S,sols,,,355,4.186905,43.888215
2020-370829,2020-11-20,000001,Vente,180000,6,,RUE DE LA MAZADE,0085,30730,30281,Saint-Mamert-du-Gard,30,,,302810000B0610,,,,,,,,,,,,,0,3,Dépendance,,0,S,sols,,,350,4.18796,43.88722
2020-370829,2020-11-20,000001,Vente,180000,6,,RUE DE LA MAZADE,0085,30730,30281,Saint-Mamert-du-Gard,30,,,302810000B0610,,,,,,,,,,,,,0,2,Appartement,87,4,S,sols,,,350,4.18796,43.88722
2020-370829,2020-11-20,000001,Vente,180000,6,,RUE DE LA MAZADE,0085,30730,30281,Saint-Mamert-du-Gard,30,,,302810000B0610,,,,,,,,,,,,,0,2,Appartement,53,2,S,sols,,,350,4.18796,43.88722
2020-371316,2020-11-16,000001,Vente,152400,3,,PL DU CIMETIERE VIEUX,0130,30730,30281,Saint-Mamert-du-Gard,30,,,302810000B0787,,,,,,,,,,,,,0,2,Appartement,79,3,S,sols,,,75,4.188691,43.886797
2020-371316,2020-11-16,000001,Vente,152400,3,,PL DU CIMETIERE VIEUX,0130,30730,30281,Saint-Mamert-du-Gard,30,,,302810000B0787,,,,,,,,,,,,,0,2,Appartement,51,2,S,sols,,,75,4.188691,43.886797
2020-371419,2020-12-03,000001,Vente,198000,502,,CHE DE SIEYRES,0124,30730,30281,Saint-Mamert-du-Gard,30,,,302810000B2623,,,,,,,,,,,,,0,,,,,S,sols,,,350,,
2020-371419,2020-12-03,000001,Vente,198000,502,,CHE DE SIEYRES,0124,30730,30281,Saint-Mamert-du-Gard,30,,,302810000B2624,,,,,,,,,,,,,0,,,,,S,sols,,,62,,
2020-371675,2020-12-09,000001,Vente,229000,21,,RUE DU CRES,0042,30730,30281,Saint-Mamert-du-Gard,30,,,302810000B1440,,,,,,,,,,,,,0,1,Maison,131,5,S,sols,,,546,4.192354,43.885011
2020-371884,2020-12-14,000001,Vente,79900,,,CHEMIN DE SAINT GENIES,B038,30730,30281,Saint-Mamert-du-Gard,30,,,302810000B2494,,,,,,,,,,,,,0,,,,,T,terres,,,433,4.192732,43.89141
2020-371953,2020-12-15,000001,Vente,225980,226,,CHE DE SAINT GENIES,0113,30730,30281,Saint-Mamert-du-Gard,30,,,302810000B2211,,,,,,,,,,,,,0,1,Maison,106,4,S,sols,,,800,4.192164,43.890263
2020-371980,2020-12-18,000001,Vente,274000,13,,RUE DE LA CARDONILLE,0029,30730,30281,Saint-Mamert-du-Gard,30,,,302810000B1445,,,,,,,,,,,,,0,1,Maison,88,5,S,sols,,,404,4.193317,43.885309
2020-371980,2020-12-18,000001,Vente,274000,13,,RUE DE LA CARDONILLE,0029,30730,30281,Saint-Mamert-du-Gard,30,,,302810000B1445,,,,,,,,,,,,,0,3,Dépendance,,0,S,sols,,,404,4.193317,43.885309
2020-371980,2020-12-18,000001,Vente,274000,,,LE CRES,B047,30730,30281,Saint-Mamert-du-Gard,30,,,302810000B1700,,,,,,,,,,,,,0,,,,,T,terres,,,224,4.193168,43.885502
2020-372686,2020-12-23,000001,Vente,183400,42,,CHE DE GAJANE,0064,30730,30281,Saint-Mamert-du-Gard,30,,,302810000B2465,,,,,,,,,,,,,0,1,Maison,65,3,S,sols,,,305,4.192788,43.889074
