id_mutation,date_mutation,numero_disposition,nature_mutation,valeur_fonciere,adresse_numero,adresse_suffixe,adresse_nom_voie,adresse_code_voie,code_postal,code_commune,nom_commune,code_departement,ancien_code_commune,ancien_nom_commune,id_parcelle,ancien_id_parcelle,numero_volume,lot1_numero,lot1_surface_carrez,lot2_numero,lot2_surface_carrez,lot3_numero,lot3_surface_carrez,lot4_numero,lot4_surface_carrez,lot5_numero,lot5_surface_carrez,nombre_lots,code_type_local,type_local,surface_reelle_bati,nombre_pieces_principales,code_nature_culture,nature_culture,code_nature_culture_speciale,nature_culture_speciale,surface_terrain,longitude,latitude
2020-363670,2020-01-30,000002,Vente,15000,,,LES CURIERES,B022,30140,30329,Thoiras,30,,,303290000B1927,,,,,,,,,,,,,0,,,,,L,landes,,,503,3.918832,44.062458
2020-364261,2020-02-28,000001,Vente,100000,5126,,MALERARGUES,B038,30140,30329,Thoiras,30,,,303290000B0784,,,,,,,,,,,,,0,1,Maison,50,3,S,sols,,,1207,3.897237,44.052786
2020-364261,2020-02-28,000001,Vente,100000,,,MALERARGUES,B038,30140,30329,Thoiras,30,,,303290000B0785,,,,,,,,,,,,,0,,,,,AB,terrains a bâtir,,,800,3.897113,44.052992
2020-364261,2020-02-28,000001,Vente,100000,,,MALERARGUES,B038,30140,30329,Thoiras,30,,,303290000B0786,,,,,,,,,,,,,0,,,,,BT,taillis simples,,,920,3.897035,44.053179
2020-364615,2020-03-09,000001,Vente,140510,5270,,LA MONTEE,B050,30140,30329,Thoiras,30,,,303290000B1887,,,,,,,,,,,,,0,1,Maison,48,3,S,sols,,,2190,,
2020-365448,2020-04-29,000001,Vente,50000,5153,,PLAINE DE PRADES,B059,30140,30329,Thoiras,30,,,303290000B0885,,,2,53,4,,,,,,,,2,2,Appartement,58,3,,,,,,3.886928,44.041647
2020-365448,2020-04-29,000001,Vente,50000,,,PLAINE DE PRADES,B059,30140,30329,Thoiras,30,,,303290000B1827,,,,,,,,,,,,,0,,,,,S,sols,,,30,3.886857,44.0417
2020-365448,2020-04-29,000001,Vente,50000,,,PLAINE DE PRADES,B059,30140,30329,Thoiras,30,,,303290000B1953,,,,,,,,,,,,,0,,,,,BT,taillis simples,,,2289,3.88618,44.042471
2020-365448,2020-04-29,000001,Vente,50000,,,PLAINE DE PRADES,B059,30140,30329,Thoiras,30,,,303290000B1955,,,,,,,,,,,,,0,,,,,L,landes,,,10301,3.886617,44.041747
2020-367427,2020-07-06,000001,Vente,70000,,,PAILLERE ET CASTELET,B054,30140,30329,Thoiras,30,,,303290000B1672,,,,,,,,,,,,,0,,,,,T,terres,,,2813,3.941726,44.053127
2020-367427,2020-07-06,000001,Vente,70000,5285,,PAILLERE ET CASTELET,B054,30140,30329,Thoiras,30,,,303290000B1675,,,,,,,,,,,,,0,1,Maison,81,3,S,sols,,,212,3.94172,44.053557
2020-367794,2020-07-27,000001,Vente,316000,,,LES ARNAUDS ET DRAILLE,B001,30140,30329,Thoiras,30,,,303290000B0263,,,,,,,,,,,,,0,,,,,T,terres,,,4630,3.924232,44.05193
2020-367794,2020-07-27,000001,Vente,316000,,,LES ARNAUDS ET DRAILLE,B001,30140,30329,Thoiras,30,,,303290000B0272,,,,,,,,,,,,,0,,,,,J,jardins,POTAG,Jardin potager,2345,3.92285,44.051439
2020-367794,2020-07-27,000001,Vente,316000,,,LES ARNAUDS ET DRAILLE,B001,30140,30329,Thoiras,30,,,303290000B0273,,,,,,,,,,,,,0,,,,,L,landes,,,2700,3.923654,44.05154
2020-367794,2020-07-27,000001,Vente,316000,,,LES ARNAUDS ET DRAILLE,B001,30140,30329,Thoiras,30,,,303290000B0274,,,,,,,,,,,,,0,,,,,VI,vignes,,,1547,3.924054,44.051503
2020-367794,2020-07-27,000001,Vente,316000,5227,,LES ARNAUDS ET DRAILLE,B001,30140,30329,Thoiras,30,,,303290000B1086,,,,,,,,,,,,,0,1,Maison,176,5,S,sols,,,551,3.922495,44.05123
2020-367794,2020-07-27,000001,Vente,316000,,,LES ARNAUDS ET DRAILLE,B001,30140,30329,Thoiras,30,,,303290000B1090,,,,,,,,,,,,,0,,,,,VI,vignes,,,293,3.923656,44.051804
2020-367794,2020-07-27,000001,Vente,316000,,,LES ARNAUDS ET DRAILLE,B001,30140,30329,Thoiras,30,,,303290000B1091,,,,,,,,,,,,,0,,,,,T,terres,,,559,3.923523,44.051772
2020-367794,2020-07-27,000001,Vente,316000,,,LES ARNAUDS ET DRAILLE,B001,30140,30329,Thoiras,30,,,303290000B1093,,,,,,,,,,,,,0,,,,,L,landes,,,1112,3.923012,44.051737
2020-367794,2020-07-27,000001,Vente,316000,,,LES ARNAUDS ET DRAILLE,B001,30140,30329,Thoiras,30,,,303290000B1096,,,,,,,,,,,,,0,,,,,L,landes,,,3540,3.924501,44.052399
2020-368565,2020-09-14,000001,Vente,45000,,,BOIS DE LAUNE,B006,30140,30329,Thoiras,30,,,303290000B0283,,,,,,,,,,,,,0,,,,,BT,taillis simples,,,7715,3.922638,44.053838
2020-368565,2020-09-14,000001,Vente,45000,,,BOIS DE LAUNE,B006,30140,30329,Thoiras,30,,,303290000B0284,,,,,,,,,,,,,0,,,,,P,prés,,,4650,3.922514,44.054325
2020-368565,2020-09-14,000001,Vente,45000,,,BOIS DE LAUNE,B006,30140,30329,Thoiras,30,,,303290000B0285,,,,,,,,,,,,,0,,,,,T,terres,,,1547,3.922963,44.0546
2020-369426,2020-09-28,000001,Vente,30000,,,LES CURIERES,B022,30140,30329,Thoiras,30,,,303290000B1928,,,,,,,,,,,,,0,,,,,L,landes,,,1667,3.919278,44.062279
2020-370694,2020-10-29,000001,Vente,100000,,,PRE DE L EUZE,B066,30140,30329,Thoiras,30,,,303290000A0194,,,,,,,,,,,,,0,,,,,VE,vergers,,,2950,3.931494,44.076249
2020-370694,2020-10-29,000001,Vente,100000,,,PRE DE L EUZE,B066,30140,30329,Thoiras,30,,,303290000A0195,,,,,,,,,,,,,0,,,,,J,jardins,POTAG,Jardin potager,1310,3.932012,44.076142
2020-370694,2020-10-29,000001,Vente,100000,,,PRE DE L EUZE,B066,30140,30329,Thoiras,30,,,303290000A0195,,,,,,,,,,,,,0,,,,,S,sols,,,24,3.932012,44.076142
2020-370694,2020-10-29,000001,Vente,100000,5016,,PRE DE L EUZE,B066,30140,30329,Thoiras,30,,,303290000A0196,,,,,,,,,,,,,0,1,Maison,130,5,S,sols,,,1616,3.931587,44.075951
2020-370694,2020-10-29,000001,Vente,100000,,,PRE DE L EUZE,B066,30140,30329,Thoiras,30,,,303290000A0406,,,,,,,,,,,,,0,,,,,S,sols,,,1195,3.932143,44.075841
2020-371065,2020-11-19,000001,Vente,150000,5210,,ROUVIERE ET MAZELET,B075,30140,30329,Thoiras,30,,,303290000B1343,,,,,,,,,,,,,0,1,Maison,89,4,BT,taillis simples,,,1417,3.905498,44.048371
2020-371065,2020-11-19,000001,Vente,150000,5210,,ROUVIERE ET MAZELET,B075,30140,30329,Thoiras,30,,,303290000B1343,,,,,,,,,,,,,0,1,Maison,89,4,S,sols,,,90,3.905498,44.048371
2020-371065,2020-11-19,000001,Vente,150000,,,ROUVIERE ET MAZELET,B075,30140,30329,Thoiras,30,,,303290000B1353,,,,,,,,,,,,,0,,,,,BT,taillis simples,,,14085,3.904853,44.049257
2020-371325,2020-12-03,000001,Vente,4000,,,PLAINE DU CHATEAU,B060,30140,30329,Thoiras,30,,,303290000B0013,,,,,,,,,,,,,0,,,,,BT,taillis simples,,,1267,3.934201,44.062695
2020-371325,2020-12-03,000001,Vente,4000,,,PLAINE DU CHATEAU,B060,30140,30329,Thoiras,30,,,303290000B0015,,,,,,,,,,,,,0,,,,,BT,taillis simples,,,109041,3.933169,44.061364
2020-371325,2020-12-03,000001,Vente,4000,,,LA MONTEE,B050,30140,30329,Thoiras,30,,,303290000B1211,,,,,,,,,,,,,0,,,,,BT,taillis simples,,,12414,3.931129,44.063087
