id_mutation,date_mutation,numero_disposition,nature_mutation,valeur_fonciere,adresse_numero,adresse_suffixe,adresse_nom_voie,adresse_code_voie,code_postal,code_commune,nom_commune,code_departement,ancien_code_commune,ancien_nom_commune,id_parcelle,ancien_id_parcelle,numero_volume,lot1_numero,lot1_surface_carrez,lot2_numero,lot2_surface_carrez,lot3_numero,lot3_surface_carrez,lot4_numero,lot4_surface_carrez,lot5_numero,lot5_surface_carrez,nombre_lots,code_type_local,type_local,surface_reelle_bati,nombre_pieces_principales,code_nature_culture,nature_culture,code_nature_culture_speciale,nature_culture_speciale,surface_terrain,longitude,latitude
2020-414504,2020-08-04,000001,Vente,185000,8,,RUE DU CANIGOU,0026,31420,31039,Bachas,31,,,31039000WB0054,,,,,,,,,,,,,0,1,Maison,66,3,J,jardins,,,3420,0.937608,43.243159
2020-414504,2020-08-04,000001,Vente,185000,8,,RUE DU CANIGOU,0026,31420,31039,Bachas,31,,,31039000WB0054,,,,,,,,,,,,,0,1,Maison,66,3,S,sols,,,500,0.937608,43.243159
2020-415070,2020-10-27,000001,Vente,92000,1,,RUE DU PIC DU MIDI,0022,31420,31039,Bachas,31,,,31039000WB0055,,,,,,,,,,,,,0,1,Maison,70,3,T,terres,,,1500,0.937299,43.243547
2020-415070,2020-10-27,000001,Vente,92000,1,,RUE DU PIC DU MIDI,0022,31420,31039,Bachas,31,,,31039000WB0055,,,,,,,,,,,,,0,1,Maison,70,3,S,sols,,,1000,0.937299,43.243547
2020-415070,2020-10-27,000001,Vente,92000,1,,RUE DU PIC DU MIDI,0022,31420,31039,Bachas,31,,,31039000WB0055,,,,,,,,,,,,,0,1,Maison,70,3,P,prés,,,1500,0.937299,43.243547
2020-415438,2020-12-12,000001,Vente,355855,213,,RUE DU CANIGOU,0026,31420,31039,Bachas,31,,,31039000WC0117,,,,,,,,,,,,,0,1,Maison,182,5,AG,terrains d'agrément,,,8120,0.940519,43.244406
2020-415438,2020-12-12,000001,Vente,355855,213,,RUE DU CANIGOU,0026,31420,31039,Bachas,31,,,31039000WC0117,,,,,,,,,,,,,0,3,Dépendance,,0,AG,terrains d'agrément,,,8120,0.940519,43.244406
2020-415438,2020-12-12,000001,Vente,355855,213,,RUE DU CANIGOU,0026,31420,31039,Bachas,31,,,31039000WC0117,,,,,,,,,,,,,0,1,Maison,182,5,S,sols,,,600,0.940519,43.244406
2020-415438,2020-12-12,000001,Vente,355855,213,,RUE DU CANIGOU,0026,31420,31039,Bachas,31,,,31039000WC0117,,,,,,,,,,,,,0,3,Dépendance,,0,S,sols,,,600,0.940519,43.244406
