id_mutation,date_mutation,numero_disposition,nature_mutation,valeur_fonciere,adresse_numero,adresse_suffixe,adresse_nom_voie,adresse_code_voie,code_postal,code_commune,nom_commune,code_departement,ancien_code_commune,ancien_nom_commune,id_parcelle,ancien_id_parcelle,numero_volume,lot1_numero,lot1_surface_carrez,lot2_numero,lot2_surface_carrez,lot3_numero,lot3_surface_carrez,lot4_numero,lot4_surface_carrez,lot5_numero,lot5_surface_carrez,nombre_lots,code_type_local,type_local,surface_reelle_bati,nombre_pieces_principales,code_nature_culture,nature_culture,code_nature_culture_speciale,nature_culture_speciale,surface_terrain,longitude,latitude
2020-404841,2020-02-07,000002,Vente,250000,75,F,EN BOURGUES,B007,31460,31179,Le Faget,31,,,31179000ZA0075,,,,,,,,,,,,,0,3,Dépendance,,0,S,sols,,,355,1.828107,43.575691
2020-404841,2020-02-07,000002,Vente,250000,154,,EN BOURGUES,B007,31460,31179,Le Faget,31,,,31179000ZA0079,,,,,,,,,,,,,0,1,Maison,179,5,S,sols,,,919,1.828279,43.575657
2020-404841,2020-02-07,000002,Vente,250000,,,EN BOURGUES,B007,31460,31179,Le Faget,31,,,31179000ZA0081,,,,,,,,,,,,,0,,,,,P,prés,,,339,1.828513,43.575703
2020-405201,2020-02-27,000001,Vente,45750,,,LA POUSARAQUE,B047,31460,31179,Le Faget,31,,,31179000ZI0096,,,,,,,,,,,,,0,,,,,AB,terrains a bâtir,,,850,1.827056,43.565567
2020-407033,2020-09-15,000001,Vente,104000,21,,LE VILLAGE,B060,31460,31179,Le Faget,31,,,31179000ZB0176,,,,,,,,,,,,,0,1,Maison,50,1,S,sols,,,254,1.823421,43.56733
2020-407033,2020-09-15,000001,Vente,104000,22,,LE VILLAGE,B060,31460,31179,Le Faget,31,,,31179000ZB0177,,,,,,,,,,,,,0,1,Maison,58,3,S,sols,,,104,1.823326,43.567381
2020-407238,2020-10-12,000001,Vente,265900,151,,EN VIALAN,B059,31460,31179,Le Faget,31,,,31179000ZD0025,,,,,,,,,,,,,0,1,Maison,110,5,T,terres,,,10670,1.848021,43.558461
2020-407238,2020-10-12,000001,Vente,265900,151,,EN VIALAN,B059,31460,31179,Le Faget,31,,,31179000ZD0025,,,,,,,,,,,,,0,1,Maison,110,5,S,sols,,,500,1.848021,43.558461
2020-408103,2020-12-23,000001,Vente,100000,,,LE CERISIER,B016,31460,31179,Le Faget,31,,,31179000ZM0043,,,,,,,,,,,,,0,,,,,J,jardins,,,165,1.823069,43.568433
2020-408103,2020-12-23,000001,Vente,100000,37,,LE CERISIER,B016,31460,31179,Le Faget,31,,,31179000ZM0045,,,,,,,,,,,,,0,1,Maison,87,3,S,sols,,,180,1.822653,43.568453
2020-408272,2020-12-23,000002,Vente,130000,2,,LE VILLAGE,B060,31460,31179,Le Faget,31,,,31179000ZB0189,,,1,,,,,,,,,,1,1,Maison,120,4,,,,,,1.826084,43.567292
2020-408355,2020-11-05,000001,Adjudication,147000,43,A,BOY GALENC,B010,31460,31179,Le Faget,31,,,31179000ZL0002,,,,,,,,,,,,,0,1,Maison,60,2,S,sols,,,696,,
2020-408355,2020-11-05,000001,Adjudication,147000,43,A,BOY GALENC,B010,31460,31179,Le Faget,31,,,31179000ZL0002,,,,,,,,,,,,,0,1,Maison,60,2,T,terres,,,7264,,
