id_mutation,date_mutation,numero_disposition,nature_mutation,valeur_fonciere,adresse_numero,adresse_suffixe,adresse_nom_voie,adresse_code_voie,code_postal,code_commune,nom_commune,code_departement,ancien_code_commune,ancien_nom_commune,id_parcelle,ancien_id_parcelle,numero_volume,lot1_numero,lot1_surface_carrez,lot2_numero,lot2_surface_carrez,lot3_numero,lot3_surface_carrez,lot4_numero,lot4_surface_carrez,lot5_numero,lot5_surface_carrez,nombre_lots,code_type_local,type_local,surface_reelle_bati,nombre_pieces_principales,code_nature_culture,nature_culture,code_nature_culture_speciale,nature_culture_speciale,surface_terrain,longitude,latitude
2020-413383,2020-02-01,000003,Echange,100,,,MATAY,B064,31160,31191,Fougaron,31,,,31191000AB0308,,,,,,,,,,,,,0,,,,,AB,terrains a bâtir,,,9,0.933275,42.98735
2020-413411,2020-01-16,000001,Vente,1000,,,MATAY,B064,31160,31191,Fougaron,31,,,31191000AB0021,,,,,,,,,,,,,0,,,,,L,landes,,,55,0.932851,42.988506
2020-413494,2020-02-07,000001,Vente,90000,82,,VILLAGE,B107,31160,31191,Fougaron,31,,,31191000AB0144,,,,,,,,,,,,,0,1,Maison,139,4,S,sols,,,82,0.929755,42.9885
2020-413494,2020-02-07,000001,Vente,90000,,,VILLAGE,B107,31160,31191,Fougaron,31,,,31191000AB0145,,,,,,,,,,,,,0,,,,,S,sols,,,81,0.929854,42.988526
2020-413494,2020-02-07,000001,Vente,90000,,,VILLAGE,B107,31160,31191,Fougaron,31,,,31191000AB0146,,,,,,,,,,,,,0,,,,,S,sols,,,107,0.929918,42.98858
2020-413620,2020-02-28,000001,Vente,95000,110,,VILLAGE,B107,31160,31191,Fougaron,31,,,31191000AB0182,,,,,,,,,,,,,0,1,Maison,46,3,S,sols,,,770,0.929543,42.98757
2020-413620,2020-02-28,000001,Vente,95000,110,,VILLAGE,B107,31160,31191,Fougaron,31,,,31191000AB0182,,,,,,,,,,,,,0,1,Maison,46,3,P,prés,,,1345,0.929543,42.98757
2020-413655,2020-03-05,000001,Vente,3840,,,CRAQUETTES,B037,31160,31191,Fougaron,31,,,311910000A0608,,,,,,,,,,,,,0,,,,,P,prés,,,740,0.933835,42.989083
2020-413655,2020-03-05,000001,Vente,3840,,,CRAQUETTES,B037,31160,31191,Fougaron,31,,,311910000A0609,,,,,,,,,,,,,0,,,,,P,prés,,,610,0.933808,42.988729
2020-413655,2020-03-05,000001,Vente,3840,,,HOUGASSE,B053,31160,31191,Fougaron,31,,,311910000A0694,,,,,,,,,,,,,0,,,,,P,prés,,,2520,0.930402,42.990809
2020-413655,2020-03-05,000001,Vente,3840,,,HOUGASSE,B053,31160,31191,Fougaron,31,,,311910000A0695,,,,,,,,,,,,,0,,,,,BT,taillis simples,,,900,0.930293,42.990521
2020-413655,2020-03-05,000001,Vente,3840,,,TRANOUN,B103,31160,31191,Fougaron,31,,,311910000D0073,,,,,,,,,,,,,0,,,,,L,landes,,,1710,0.933173,42.983561
2020-413655,2020-03-05,000001,Vente,3840,,,TRANOUN,B103,31160,31191,Fougaron,31,,,311910000D0074,,,,,,,,,,,,,0,,,,,P,prés,,,4600,0.933208,42.983028
2020-413655,2020-03-05,000001,Vente,3840,,,LA SAULO,B095,31160,31191,Fougaron,31,,,311910000D0086,,,,,,,,,,,,,0,,,,,BT,taillis simples,,,145,0.934095,42.98162
2020-413655,2020-03-05,000001,Vente,3840,,,PRAT DE LA BORIO,B089,31160,31191,Fougaron,31,,,311910000D0537,,,,,,,,,,,,,0,,,,,L,landes,,,545,0.932434,42.984008
2020-413655,2020-03-05,000001,Vente,3840,,,PRAT DE LA BORIO,B089,31160,31191,Fougaron,31,,,311910000D0538,,,,,,,,,,,,,0,,,,,L,landes,,,2280,0.932111,42.9841
2020-413655,2020-03-05,000001,Vente,3840,,,PICHOUNOS,B083,31160,31191,Fougaron,31,,,311910000D0622,,,,,,,,,,,,,0,,,,,P,prés,,,3285,0.927812,42.982742
2020-413655,2020-03-05,000001,Vente,3840,,,GARRABE,B044,31160,31191,Fougaron,31,,,311910000D0979,,,,,,,,,,,,,0,,,,,P,prés,,,2275,0.924764,42.987563
2020-413655,2020-03-05,000001,Vente,3840,,,TRANOUN,B103,31160,31191,Fougaron,31,,,311910000D1246,,,,,,,,,,,,,0,,,,,P,prés,,,1845,0.932882,42.985094
2020-414135,2020-06-10,000001,Vente,130570,,,PELACH ET OUMBRE DET DOS,B080,31160,31191,Fougaron,31,,,311910000D1071,,,,,,,,,,,,,0,,,,,P,prés,,,1950,0.926528,42.990377
2020-414135,2020-06-10,000001,Vente,130570,17,A,CARBOUES ET MOLO,B020,31160,31191,Fougaron,31,,,311910000D1072,,,,,,,,,,,,,0,1,Maison,170,5,S,sols,,,220,0.926713,42.989897
2020-414135,2020-06-10,000001,Vente,130570,,,CARBOUES ET MOLO,B020,31160,31191,Fougaron,31,,,311910000D1206,,,,,,,,,,,,,0,,,,,S,sols,,,315,0.926726,42.989725
2020-415427,2020-12-07,000001,Vente,56500,,,VILLAGE,B107,31160,31191,Fougaron,31,,,31191000AB0134,,,,,,,,,,,,,0,,,,,J,jardins,,,547,0.930579,42.98865
2020-415427,2020-12-07,000001,Vente,56500,,,VILLAGE,B107,31160,31191,Fougaron,31,,,31191000AB0135,,,,,,,,,,,,,0,,,,,P,prés,,,749,0.930317,42.988624
2020-415427,2020-12-07,000001,Vente,56500,80,,VILLAGE,B107,31160,31191,Fougaron,31,,,31191000AB0147,,,,,,,,,,,,,0,1,Maison,130,5,S,sols,,,483,0.930091,42.988498
2020-415427,2020-12-07,000001,Vente,56500,,,VILLAGE,B107,31160,31191,Fougaron,31,,,31191000AB0229,,,,,,,,,,,,,0,,,,,P,prés,,,182,0.930113,42.988656
