id_mutation,date_mutation,numero_disposition,nature_mutation,valeur_fonciere,adresse_numero,adresse_suffixe,adresse_nom_voie,adresse_code_voie,code_postal,code_commune,nom_commune,code_departement,ancien_code_commune,ancien_nom_commune,id_parcelle,ancien_id_parcelle,numero_volume,lot1_numero,lot1_surface_carrez,lot2_numero,lot2_surface_carrez,lot3_numero,lot3_surface_carrez,lot4_numero,lot4_surface_carrez,lot5_numero,lot5_surface_carrez,nombre_lots,code_type_local,type_local,surface_reelle_bati,nombre_pieces_principales,code_nature_culture,nature_culture,code_nature_culture_speciale,nature_culture_speciale,surface_terrain,longitude,latitude
2020-413397,2020-01-22,000001,Vente,2240,,,DELAPART,B027,31160,31348,Moncaup,31,,,313480000A1634,,,,,,,,,,,,,0,,,,,P,prés,,,448,0.706971,42.977361
2020-414009,2020-05-20,000001,Vente,500,,,CAOUBEROS,B013,31160,31348,Moncaup,31,,,313480000A0013,,,,,,,,,,,,,0,,,,,L,landes,,,1080,0.704288,42.980507
2020-414622,2020-09-05,000001,Vente,350,,,VILLAGE,B066,31160,31348,Moncaup,31,,,313480000A1000,,,,,,,,,,,,,0,,,,,P,prés,,,660,0.705352,42.979229
2020-414939,2020-10-09,000001,Vente,300,,,VILLAGE,B066,31160,31348,Moncaup,31,,,313480000A1001,,,,,,,,,,,,,0,,,,,P,prés,,,840,0.705481,42.979156
2020-415201,2020-11-04,000001,Vente,83000,,,VILLAGE,B066,31160,31348,Moncaup,31,,,313480000A1004,,,,,,,,,,,,,0,,,,,P,prés,,,2135,0.705074,42.978636
2020-415201,2020-11-04,000001,Vente,83000,,,RUE DE LA HOUNT,0110,31160,31348,Moncaup,31,,,313480000A1005,,,,,,,,,,,,,0,1,Maison,85,4,S,sols,,,155,0.704769,42.978703
2020-415201,2020-11-04,000001,Vente,83000,,,VILLAGE,B066,31160,31348,Moncaup,31,,,313480000A1011,,,,,,,,,,,,,0,,,,,J,jardins,,,160,0.705417,42.978553
2020-415386,2020-12-04,000001,Vente,109300,,,VILLAGE,B066,31160,31348,Moncaup,31,,,313480000A1043,,,,,,,,,,,,,0,,,,,P,prés,,,1125,0.7067,42.978315
2020-415386,2020-12-04,000001,Vente,109300,,,VILLAGE,B066,31160,31348,Moncaup,31,,,313480000A1643,,,,,,,,,,,,,0,,,,,S,sols,,,207,0.706271,42.978465
2020-415386,2020-12-04,000001,Vente,109300,,,RTE DE L ECOLE,0070,31160,31348,Moncaup,31,,,313480000A1644,,,,,,,,,,,,,0,3,Dépendance,,0,S,sols,,,503,0.70642,42.978574
2020-415386,2020-12-04,000001,Vente,109300,,,RTE DE L ECOLE,0070,31160,31348,Moncaup,31,,,313480000A1644,,,,,,,,,,,,,0,1,Maison,160,3,S,sols,,,503,0.70642,42.978574
2020-415539,2020-12-22,000001,Vente,176000,,,VILLAGE,B066,31160,31348,Moncaup,31,,,313480000A1037,,,,,,,,,,,,,0,,,,,S,sols,,,85,0.706505,42.977915
2020-415539,2020-12-22,000001,Vente,176000,,,RTE D ARGUENOS,0080,31160,31348,Moncaup,31,,,313480000A1038,,,,,,,,,,,,,0,1,Maison,159,5,S,sols,,,355,0.706628,42.978055
2020-415539,2020-12-22,000001,Vente,176000,,,RTE D ARGUENOS,0080,31160,31348,Moncaup,31,,,313480000A1038,,,,,,,,,,,,,0,3,Dépendance,,0,S,sols,,,355,0.706628,42.978055
2020-415539,2020-12-22,000001,Vente,176000,,,VILLAGE,B066,31160,31348,Moncaup,31,,,313480000A1039,,,,,,,,,,,,,0,,,,,J,jardins,,,60,0.706541,42.978018
2020-415539,2020-12-22,000001,Vente,176000,,,VILLAGE,B066,31160,31348,Moncaup,31,,,313480000A1744,,,,,,,,,,,,,0,,,,,P,prés,,,600,0.706835,42.977994
