id_mutation,date_mutation,numero_disposition,nature_mutation,valeur_fonciere,adresse_numero,adresse_suffixe,adresse_nom_voie,adresse_code_voie,code_postal,code_commune,nom_commune,code_departement,ancien_code_commune,ancien_nom_commune,id_parcelle,ancien_id_parcelle,numero_volume,lot1_numero,lot1_surface_carrez,lot2_numero,lot2_surface_carrez,lot3_numero,lot3_surface_carrez,lot4_numero,lot4_surface_carrez,lot5_numero,lot5_surface_carrez,nombre_lots,code_type_local,type_local,surface_reelle_bati,nombre_pieces_principales,code_nature_culture,nature_culture,code_nature_culture_speciale,nature_culture_speciale,surface_terrain,longitude,latitude
2020-417265,2020-05-26,000001,Vente,291750,5092,,A PANJAS,B062,32290,32022,Avéron-Bergelle,32,,,320220000A0561,,,,,,,,,,,,,0,1,Maison,55,3,S,sols,,,1250,0.068471,43.764744
2020-417265,2020-05-26,000001,Vente,291750,5092,,A PANJAS,B062,32290,32022,Avéron-Bergelle,32,,,320220000A0561,,,,,,,,,,,,,0,1,Maison,176,5,S,sols,,,1250,0.068471,43.764744
2020-417265,2020-05-26,000001,Vente,291750,,,A PANJAS,B062,32290,32022,Avéron-Bergelle,32,,,320220000A0932,,,,,,,,,,,,,0,,,,,S,sols,,,700,0.068301,43.764732
2020-417265,2020-05-26,000001,Vente,291750,,,A PANJAS,B062,32290,32022,Avéron-Bergelle,32,,,320220000A0934,,,,,,,,,,,,,0,,,,,T,terres,,,142,0.068684,43.764619
2020-417265,2020-05-26,000001,Vente,291750,,,A PANJAS,B062,32290,32022,Avéron-Bergelle,32,,,320220000A0935,,,,,,,,,,,,,0,,,,,T,terres,,,472,0.068782,43.765005
2020-417994,2020-07-17,000001,Vente,24000,,,AU TOURON,B087,32290,32022,Avéron-Bergelle,32,,,320220000A0024,,,,,,,,,,,,,0,,,,,E,eaux,MARE,Mare,692,0.048796,43.768379
2020-417994,2020-07-17,000001,Vente,24000,,,AU TOURON,B087,32290,32022,Avéron-Bergelle,32,,,320220000A0946,,,,,,,,,,,,,0,,,,,P,prés,,,410,0.048883,43.768383
2020-417994,2020-07-17,000001,Vente,24000,,,AU TOURON,B087,32290,32022,Avéron-Bergelle,32,,,320220000A0947,,,,,,,,,,,,,0,,,,,P,prés,,,688,0.04887,43.768159
2020-417994,2020-07-17,000001,Vente,24000,,,AU HEMAT,B024,32290,32022,Avéron-Bergelle,32,,,320220000A0950,,,,,,,,,,,,,0,,,,,S,sols,,,7,0.048607,43.768072
2020-417994,2020-07-17,000001,Vente,24000,,,AU HEMAT,B024,32290,32022,Avéron-Bergelle,32,,,320220000A0955,,,,,,,,,,,,,0,,,,,S,sols,,,487,0.048864,43.768071
2020-417994,2020-07-17,000001,Vente,24000,,,AU HEMAT,B024,32290,32022,Avéron-Bergelle,32,,,320220000A0955,,,,,,,,,,,,,0,,,,,P,prés,,,474,0.048864,43.768071
2020-419333,2020-10-23,000001,Vente,50000,5072,,A LA RUE,B082,32290,32022,Avéron-Bergelle,32,,,320220000D0148,,,,,,,,,,,,,0,1,Maison,60,3,S,sols,,,458,0.067334,43.74742
2020-419333,2020-10-23,000001,Vente,50000,,,A DUBALIN,B017,32290,32022,Avéron-Bergelle,32,,,320220000D0394,,,,,,,,,,,,,0,,,,,T,terres,,,1578,0.067623,43.747673
2020-420276,2020-12-21,000001,Vente,65000,,,A TROMPET,B088,32290,32022,Avéron-Bergelle,32,,,320220000C0263,,,,,,,,,,,,,0,,,,,P,prés,,,1765,0.080225,43.733334
2020-420276,2020-12-21,000001,Vente,65000,,,A TROMPET,B088,32290,32022,Avéron-Bergelle,32,,,320220000C0264,,,,,,,,,,,,,0,,,,,T,terres,,,4454,0.079796,43.733514
2020-420276,2020-12-21,000001,Vente,65000,,,A TROMPET,B088,32290,32022,Avéron-Bergelle,32,,,320220000C0265,,,,,,,,,,,,,0,,,,,T,terres,,,1269,0.080192,43.733955
2020-420276,2020-12-21,000001,Vente,65000,,,A TROMPET,B088,32290,32022,Avéron-Bergelle,32,,,320220000C0266,,,,,,,,,,,,,0,,,,,J,jardins,,,1020,0.079649,43.733762
2020-420276,2020-12-21,000001,Vente,65000,5042,,A MAISTRE,B049,32290,32022,Avéron-Bergelle,32,,,320220000C0267,,,,,,,,,,,,,0,1,Maison,58,3,S,sols,,,1364,0.079273,43.733793
2020-420276,2020-12-21,000001,Vente,65000,,,A TROMPET,B088,32290,32022,Avéron-Bergelle,32,,,320220000C0268,,,,,,,,,,,,,0,,,,,J,jardins,,,508,0.079666,43.733973
2020-420276,2020-12-21,000001,Vente,65000,,,A TROMPET,B088,32290,32022,Avéron-Bergelle,32,,,320220000C0269,,,,,,,,,,,,,0,,,,,VE,vergers,,,827,0.079991,43.734136
2020-420276,2020-12-21,000001,Vente,65000,,,A TROMPET,B088,32290,32022,Avéron-Bergelle,32,,,320220000C0270,,,,,,,,,,,,,0,,,,,T,terres,,,6058,0.079621,43.734276
2020-420276,2020-12-21,000001,Vente,65000,,,A TROMPET,B088,32290,32022,Avéron-Bergelle,32,,,320220000C0271,,,,,,,,,,,,,0,,,,,T,terres,,,4720,0.079052,43.734697
2020-420276,2020-12-21,000001,Vente,65000,,,A TROMPET,B088,32290,32022,Avéron-Bergelle,32,,,320220000C0272,,,,,,,,,,,,,0,,,,,T,terres,,,4360,0.078457,43.734174
2020-420276,2020-12-21,000001,Vente,65000,,,A TROMPET,B088,32290,32022,Avéron-Bergelle,32,,,320220000C0273,,,,,,,,,,,,,0,,,,,P,prés,,,8104,0.079105,43.733577
2020-420276,2020-12-21,000001,Vente,65000,,,A TROMPET,B088,32290,32022,Avéron-Bergelle,32,,,320220000C0274,,,,,,,,,,,,,0,,,,,P,prés,,,12220,0.078357,43.733059
