id_mutation,date_mutation,numero_disposition,nature_mutation,valeur_fonciere,adresse_numero,adresse_suffixe,adresse_nom_voie,adresse_code_voie,code_postal,code_commune,nom_commune,code_departement,ancien_code_commune,ancien_nom_commune,id_parcelle,ancien_id_parcelle,numero_volume,lot1_numero,lot1_surface_carrez,lot2_numero,lot2_surface_carrez,lot3_numero,lot3_surface_carrez,lot4_numero,lot4_surface_carrez,lot5_numero,lot5_surface_carrez,nombre_lots,code_type_local,type_local,surface_reelle_bati,nombre_pieces_principales,code_nature_culture,nature_culture,code_nature_culture_speciale,nature_culture_speciale,surface_terrain,longitude,latitude
2020-415990,2020-02-08,000001,Vente,77000,25,,AV DU PONANT,0212,32410,32035,Beaucaire,32,,,32035000AR0162,,,,,,,,,,,,,0,1,Maison,110,3,S,sols,,,58,0.384939,43.837553
2020-416678,2020-04-15,000001,Vente,282930,,,BEZE,B003,32410,32035,Beaucaire,32,,,32035000AE0121,,,,,,,,,,,,,0,,,,,P,prés,,,1397,0.380037,43.839749
2020-416678,2020-04-15,000001,Vente,282930,5003,,LES ARROUQUETS,B090,32410,32035,Beaucaire,32,,,32035000AE0179,,,,,,,,,,,,,0,1,Maison,221,7,P,prés,,,5747,0.380982,43.83929
2020-416678,2020-04-15,000001,Vente,282930,5003,,LES ARROUQUETS,B090,32410,32035,Beaucaire,32,,,32035000AE0179,,,,,,,,,,,,,0,1,Maison,221,7,S,sols,,,980,0.380982,43.83929
2020-416828,2020-05-07,000001,Vente,145000,5044,,BIDALET,B005,32410,32035,Beaucaire,32,,,32035000AI0044,,,,,,,,,,,,,0,3,Dépendance,,0,P,prés,,,1435,0.393149,43.852699
2020-416828,2020-05-07,000001,Vente,145000,5044,,BIDALET,B005,32410,32035,Beaucaire,32,,,32035000AI0044,,,,,,,,,,,,,0,3,Dépendance,,0,S,sols,,,720,0.393149,43.852699
2020-416828,2020-05-07,000001,Vente,145000,5044,,BIDALET,B005,32410,32035,Beaucaire,32,,,32035000AI0044,,,,,,,,,,,,,0,1,Maison,85,3,S,sols,,,720,0.393149,43.852699
2020-416828,2020-05-07,000001,Vente,145000,5044,,BIDALET,B005,32410,32035,Beaucaire,32,,,32035000AI0044,,,,,,,,,,,,,0,1,Maison,85,3,P,prés,,,1435,0.393149,43.852699
2020-417016,2020-05-22,000001,Vente,200000,,,LARCHER,B047,32410,32035,Beaucaire,32,,,32035000AL0004,,,,,,,,,,,,,0,,,,,BT,taillis simples,,,15245,0.391841,43.842205
2020-417016,2020-05-22,000001,Vente,200000,,,LARCHER,B047,32410,32035,Beaucaire,32,,,32035000AL0006,,,,,,,,,,,,,0,,,,,P,prés,,,3540,0.394477,43.842192
2020-417016,2020-05-22,000001,Vente,200000,5050,,LARCHER,B047,32410,32035,Beaucaire,32,,,32035000AL0007,,,,,,,,,,,,,0,1,Maison,70,3,S,sols,,,4555,0.393798,43.841499
2020-417016,2020-05-22,000001,Vente,200000,,,COUSTON,B031,32410,32035,Beaucaire,32,,,32035000AL0015,,,,,,,,,,,,,0,,,,,BT,taillis simples,,,1247,0.391955,43.840546
2020-417016,2020-05-22,000001,Vente,200000,,,COUSTON,B031,32410,32035,Beaucaire,32,,,32035000AL0021,,,,,,,,,,,,,0,,,,,BT,taillis simples,,,1820,0.392711,43.839602
2020-417016,2020-05-22,000001,Vente,200000,,,LARCHER,B047,32410,32035,Beaucaire,32,,,32035000AL0194,,,,,,,,,,,,,0,,,,,T,terres,,,8495,0.392616,43.842051
2020-417016,2020-05-22,000001,Vente,200000,5050,A,LARCHER,B047,32410,32035,Beaucaire,32,,,32035000AL0196,,,,,,,,,,,,,0,1,Maison,124,5,S,sols,,,2150,0.393967,43.841426
2020-417016,2020-05-22,000001,Vente,200000,5050,A,LARCHER,B047,32410,32035,Beaucaire,32,,,32035000AL0196,,,,,,,,,,,,,0,1,Maison,124,5,T,terres,,,13483,0.393967,43.841426
2020-417083,2020-05-29,000001,Vente,40000,31,,RUE DU LAVOIR,0175,32410,32035,Beaucaire,32,,,32035000AR0058,,,,,,,,,,,,,0,1,Maison,78,3,S,sols,,,167,0.385709,43.837291
2020-417292,2020-06-09,000001,Vente,2300,,,SABAZAN,B080,32410,32035,Beaucaire,32,,,32035000AS0093,,,,,,,,,,,,,0,,,,,T,terres,,,2654,0.379456,43.831255
2020-417385,2020-06-16,000001,Vente,8000,,,CAPITAINE,B021,32410,32035,Beaucaire,32,,,32035000AH0032,,,,,,,,,,,,,0,,,,,T,terres,,,10345,0.388659,43.840381
2020-417442,2020-06-11,000001,Vente,12657.9,,,SOULAN,B082,32410,32035,Beaucaire,32,,,32035000AT0121,,,,,,,,,,,,,0,,,,,T,terres,,,18301,0.369245,43.838143
2020-417516,2020-06-11,000001,Echange,12657.9,,,SOULAN,B082,32410,32035,Beaucaire,32,,,32035000AT0121,,,,,,,,,,,,,0,,,,,T,terres,,,18301,0.369245,43.838143
2020-417516,2020-06-11,000002,Echange,12657.9,,,TOULAN,B084,32410,32035,Beaucaire,32,,,32035000AD0076,,,,,,,,,,,,,0,,,,,T,terres,,,17310,0.372392,43.840082
2020-417977,2020-08-04,000001,Vente,47342.1,,,PIREAU,B072,32410,32035,Beaucaire,32,,,32035000AV0003,,,,,,,,,,,,,0,,,,,T,terres,,,5765,0.365045,43.830028
2020-417977,2020-08-04,000001,Vente,47342.1,,,PIREAU,B072,32410,32035,Beaucaire,32,,,32035000AV0006,,,,,,,,,,,,,0,,,,,T,terres,,,11895,0.366534,43.833778
2020-417977,2020-08-04,000001,Vente,47342.1,,,PIREAU,B072,32410,32035,Beaucaire,32,,,32035000AV0118,,,,,,,,,,,,,0,,,,,T,terres,,,31627,0.364616,43.831313
2020-417977,2020-08-04,000001,Vente,47342.1,,,PICART,B069,32410,32035,Beaucaire,32,,,32035000AV0119,,,,,,,,,,,,,0,,,,,T,terres,,,7063,0.364598,43.828849
2020-417977,2020-08-04,000001,Vente,47342.1,,,PIREAU,B072,32410,32035,Beaucaire,32,,,32035000AV0122,,,,,,,,,,,,,0,,,,,T,terres,,,10710,0.365605,43.831866
2020-417977,2020-08-04,000001,Vente,47342.1,,,PIREAU,B072,32410,32035,Beaucaire,32,,,32035000AV0122,,,,,,,,,,,,,0,,,,,BT,taillis simples,,,4800,0.365605,43.831866
2020-418732,2020-10-01,000001,Vente,60000,,,ECLUSE DE LA TURAQUE,B034,32410,32035,Beaucaire,32,,,32035000AI0099,,,,,,,,,,,,,0,,,,,P,prés,,,5960,0.381247,43.849719
2020-418732,2020-10-01,000001,Vente,60000,2275,,RTE DE LA BAISE,0030,32410,32035,Beaucaire,32,,,32035000AI0100,,,,,,,,,,,,,0,1,Maison,30,1,S,sols,,,90,0.381251,43.850654
2020-418732,2020-10-01,000001,Vente,60000,5141,,ECLUSE DE LA TURAQUE,B034,32410,32035,Beaucaire,32,,,32035000AI0101,,,,,,,,,,,,,0,4,Local industriel. commercial ou assimilé,,,S,sols,,,2684,0.381008,43.849806
2020-418732,2020-10-01,000001,Vente,60000,,,ECLUSE DE LA TURAQUE,B034,32410,32035,Beaucaire,32,,,32035000AI0102,,,,,,,,,,,,,0,,,,,BT,taillis simples,,,14390,0.38045,43.849867
2020-419122,2020-10-29,000001,Vente,170000,,,VILLAGE,B088,32410,32035,Beaucaire,32,,,32035000AR0031,,,,,,,,,,,,,0,,,,,J,jardins,,,280,0.385537,43.838139
2020-419122,2020-10-29,000001,Vente,170000,36,,RUE DES ARCADES,0013,32410,32035,Beaucaire,32,,,32035000AR0159,,,,,,,,,,,,,0,1,Maison,157,3,S,sols,,,124,0.385593,43.838034
2020-420260,2020-12-08,000001,Vente,47000,,,LOC,B054,32410,32035,Beaucaire,32,,,32035000AS0026,,,,,,,,,,,,,0,,,,,P,prés,,,16070,0.385635,43.835394
2020-420260,2020-12-08,000001,Vente,47000,,,LOC,B054,32410,32035,Beaucaire,32,,,32035000AS0028,,,,,,,,,,,,,0,,,,,P,prés,,,8975,0.383747,43.833485
2020-420260,2020-12-08,000001,Vente,47000,,,LOC,B054,32410,32035,Beaucaire,32,,,32035000AS0030,,,,,,,,,,,,,0,,,,,T,terres,,,27175,0.3867,43.834247
