id_mutation,date_mutation,numero_disposition,nature_mutation,valeur_fonciere,adresse_numero,adresse_suffixe,adresse_nom_voie,adresse_code_voie,code_postal,code_commune,nom_commune,code_departement,ancien_code_commune,ancien_nom_commune,id_parcelle,ancien_id_parcelle,numero_volume,lot1_numero,lot1_surface_carrez,lot2_numero,lot2_surface_carrez,lot3_numero,lot3_surface_carrez,lot4_numero,lot4_surface_carrez,lot5_numero,lot5_surface_carrez,nombre_lots,code_type_local,type_local,surface_reelle_bati,nombre_pieces_principales,code_nature_culture,nature_culture,code_nature_culture_speciale,nature_culture_speciale,surface_terrain,longitude,latitude
2020-416541,2020-03-04,000001,Vente,29344,,,AU MESSEGUE,B044,32490,32090,Castillon-Savès,32,,,320900000A0399,,,,,,,,,,,,,0,,,,,T,terres,,,5280,0.991589,43.56938
2020-416541,2020-03-04,000001,Vente,29344,,,AU MESSEGUE,B044,32490,32090,Castillon-Savès,32,,,320900000A0400,,,,,,,,,,,,,0,,,,,T,terres,,,5660,0.992306,43.569183
2020-416541,2020-03-04,000001,Vente,29344,,,AU MESSEGUE,B044,32490,32090,Castillon-Savès,32,,,320900000A0410,,,,,,,,,,,,,0,,,,,T,terres,,,8804,0.992868,43.570441
2020-416541,2020-03-04,000001,Vente,29344,,,AU MESSEGUE,B044,32490,32090,Castillon-Savès,32,,,320900000A0411,,,,,,,,,,,,,0,,,,,T,terres,,,9600,0.99193,43.570319
2020-416832,2020-05-04,000001,Vente,39078,,,A LA MOUNICHE,B049,32490,32090,Castillon-Savès,32,,,320900000D0212,,,,,,,,,,,,,0,,,,,T,terres,,,2900,0.966878,43.567337
2020-416832,2020-05-04,000001,Vente,39078,,,A LA MOUNICHE,B049,32490,32090,Castillon-Savès,32,,,320900000D0213,,,,,,,,,,,,,0,,,,,BT,taillis simples,,,3680,0.96688,43.568116
2020-416832,2020-05-04,000001,Vente,39078,,,A LA MOUNICHE,B049,32490,32090,Castillon-Savès,32,,,320900000D0231,,,,,,,,,,,,,0,,,,,T,terres,,,8130,0.967583,43.568437
2020-416832,2020-05-04,000001,Vente,39078,,,A LA MOUNICHE,B049,32490,32090,Castillon-Savès,32,,,320900000D0234,,,,,,,,,,,,,0,,,,,BT,taillis simples,,,1640,0.967531,43.5678
2020-416832,2020-05-04,000001,Vente,39078,,,A LA MOUNICHE,B049,32490,32090,Castillon-Savès,32,,,320900000D0235,,,,,,,,,,,,,0,,,,,T,terres,,,6580,0.967961,43.567722
2020-416832,2020-05-04,000001,Vente,39078,,,A LA MOUNICHE,B049,32490,32090,Castillon-Savès,32,,,320900000D0237,,,,,,,,,,,,,0,,,,,T,terres,,,3220,0.968457,43.567734
2020-416832,2020-05-04,000001,Vente,39078,,,A LA MOUNICHE,B049,32490,32090,Castillon-Savès,32,,,320900000D0771,,,,,,,,,,,,,0,,,,,T,terres,,,1560,0.968743,43.568081
2020-416832,2020-05-04,000001,Vente,39078,,,A LA MOUNICHE,B049,32490,32090,Castillon-Savès,32,,,320900000D0837,,,,,,,,,,,,,0,,,,,T,terres,,,2013,0.96806,43.568875
2020-416832,2020-05-04,000001,Vente,39078,,,A LA MOUNICHE,B049,32490,32090,Castillon-Savès,32,,,320900000D0839,,,,,,,,,,,,,0,,,,,T,terres,,,4554,0.968579,43.568619
2020-416832,2020-05-04,000001,Vente,39078,,,A LA MOUNICHE,B049,32490,32090,Castillon-Savès,32,,,320900000D0841,,,,,,,,,,,,,0,,,,,T,terres,,,2171,0.969134,43.56846
2020-416832,2020-05-04,000001,Vente,39078,,,A LA MOUNICHE,B049,32490,32090,Castillon-Savès,32,,,320900000D0843,,,,,,,,,,,,,0,,,,,T,terres,,,1227,0.969295,43.568358
2020-416832,2020-05-04,000001,Vente,39078,,,A LA MOUNICHE,B049,32490,32090,Castillon-Savès,32,,,320900000D0845,,,,,,,,,,,,,0,,,,,T,terres,,,1359,0.969495,43.5683
2020-416832,2020-05-04,000001,Vente,39078,,,A LA MOUNICHE,B049,32490,32090,Castillon-Savès,32,,,320900000D0847,,,,,,,,,,,,,0,,,,,T,terres,,,1798,0.968785,43.567571
2020-416832,2020-05-04,000001,Vente,39078,,,A LA MOUNICHE,B049,32490,32090,Castillon-Savès,32,,,320900000D0849,,,,,,,,,,,,,0,,,,,T,terres,,,454,0.969143,43.567778
2020-416834,2020-04-27,000001,Vente,227200,,,A ENMAGNE,B020,32490,32090,Castillon-Savès,32,,,320900000A0941,,,,,,,,,,,,,0,,,,,S,sols,,,40,1.0025,43.5654
2020-416834,2020-04-27,000001,Vente,227200,,,A ENMAGNE,B020,32490,32090,Castillon-Savès,32,,,320900000A0942,,,,,,,,,,,,,0,,,,,T,terres,,,226,1.002439,43.565338
2020-416834,2020-04-27,000001,Vente,227200,5123,,A ENGALES,B013,32490,32090,Castillon-Savès,32,,,320900000A0944,,,,,,,,,,,,,0,1,Maison,98,4,T,terres,,,1684,1.002404,43.564862
2020-416834,2020-04-27,000001,Vente,227200,5123,,A ENGALES,B013,32490,32090,Castillon-Savès,32,,,320900000A0944,,,,,,,,,,,,,0,1,Maison,98,4,S,sols,,,1000,1.002404,43.564862
2020-417192,2020-05-15,000001,Vente,325000,5877,,AU MESSEGUE,B044,32490,32090,Castillon-Savès,32,,,320900000A0877,,,,,,,,,,,,,0,1,Maison,137,6,S,sols,,,700,0.988693,43.568982
2020-417192,2020-05-15,000001,Vente,325000,5877,,AU MESSEGUE,B044,32490,32090,Castillon-Savès,32,,,320900000A0877,,,,,,,,,,,,,0,1,Maison,137,6,T,terres,,,1011,0.988693,43.568982
2020-417192,2020-05-15,000001,Vente,325000,5001,,AU MESSEGUE,B044,32490,32090,Castillon-Savès,32,,,320900000A0879,,,,,,,,,,,,,0,3,Dépendance,,0,J,jardins,,,789,0.989036,43.568915
2020-417192,2020-05-15,000001,Vente,325000,,,AU MESSEGUE,B044,32490,32090,Castillon-Savès,32,,,320900000A0882,,,,,,,,,,,,,0,,,,,T,terres,,,149,0.988698,43.568684
2020-417192,2020-05-15,000001,Vente,325000,,,AU MESSEGUE,B044,32490,32090,Castillon-Savès,32,,,320900000A0884,,,,,,,,,,,,,0,,,,,T,terres,,,77,0.988979,43.568636
2020-417767,2020-07-10,000001,Vente,210000,,,A ENMAGNE,B020,32490,32090,Castillon-Savès,32,,,320900000A0899,,,,,,,,,,,,,0,,,,,S,sols,,,209,0.999254,43.568098
2020-417767,2020-07-10,000001,Vente,210000,,,A ENMAGNE,B020,32490,32090,Castillon-Savès,32,,,320900000A0904,,,,,,,,,,,,,0,,,,,S,sols,,,773,0.999977,43.56802
2020-417767,2020-07-10,000001,Vente,210000,,,A ENMAGNE,B020,32490,32090,Castillon-Savès,32,,,320900000A0906,,,,,,,,,,,,,0,,,,,S,sols,,,18,0.999283,43.568045
2020-417767,2020-07-10,000001,Vente,210000,8,,LOT LA PEYRADE,A010,32490,32090,Castillon-Savès,32,,,320900000A1073,,,,,,,,,,,,,0,1,Maison,105,4,S,sols,,,435,1.000147,43.568444
2020-417767,2020-07-10,000001,Vente,210000,,,A ENMAGNE,B020,32490,32090,Castillon-Savès,32,,,320900000A1076,,,,,,,,,,,,,0,,,,,S,sols,,,314,1.00019,43.568216
2020-417960,2020-07-18,000001,Vente,390100,14,,CHEM DE LAS GRAVES,0020,32490,32090,Castillon-Savès,32,,,320900000A1132,,,,,,,,,,,,,0,1,Maison,102,4,S,sols,,,1000,1.004446,43.56769
2020-417960,2020-07-18,000001,Vente,390100,14,,CHEM DE LAS GRAVES,0020,32490,32090,Castillon-Savès,32,,,320900000A1132,,,,,,,,,,,,,0,1,Maison,102,4,AG,terrains d'agrément,,,1185,1.004446,43.56769
2020-417960,2020-07-18,000001,Vente,390100,14,,CHEM DE LAS GRAVES,0020,32490,32090,Castillon-Savès,32,,,320900000A1133,,,,,,,,,,,,,0,,,,,S,sols,,,151,1.004716,43.567592
2020-417960,2020-07-18,000001,Vente,390100,,,A ENMAGNE,B020,32490,32090,Castillon-Savès,32,,,320900000A1138,,,,,,,,,,,,,0,,,,,S,sols,,,11,1.004314,43.567815
2020-418834,2020-10-02,000001,Vente,20000,,,AU GEBRA,B027,32490,32090,Castillon-Savès,32,,,320900000B0153,,,,,,,,,,,,,0,,,,,T,terres,,,9130,0.992338,43.565422
2020-418834,2020-10-02,000001,Vente,20000,,,AU GEBRA,B027,32490,32090,Castillon-Savès,32,,,320900000B0155,,,,,,,,,,,,,0,,,,,T,terres,,,10901,0.991492,43.564775
2020-418940,2020-10-20,000001,Vente,8000,,,A ENCONQUET,B012,32490,32090,Castillon-Savès,32,,,320900000A0673,,,,,,,,,,,,,0,,,,,T,terres,,,3117,0.978052,43.57612
2020-418940,2020-10-20,000001,Vente,8000,,,A ENCONQUET,B012,32490,32090,Castillon-Savès,32,,,320900000A0675,,,,,,,,,,,,,0,,,,,T,terres,,,2667,0.978913,43.575944
2020-418940,2020-10-20,000001,Vente,8000,,,A ENCONQUET,B012,32490,32090,Castillon-Savès,32,,,320900000A0677,,,,,,,,,,,,,0,,,,,T,terres,,,5004,0.979208,43.5754
2020-419066,2020-10-08,000001,Vente,10000,,,AU GEBRA,B027,32490,32090,Castillon-Savès,32,,,320900000B0176,,,,,,,,,,,,,0,,,,,T,terres,,,9801,0.991942,43.563627
2020-419449,2020-11-23,000002,Vente,2000,,,A LASSORBES,B041,32490,32090,Castillon-Savès,32,,,320900000B0441,,,,,,,,,,,,,0,,,,,BF,futaies feuillues,,,186,0.986359,43.567563
2020-419563,2020-11-05,000001,Vente,346200,1,,LOT LA PEYRADE,A010,32490,32090,Castillon-Savès,32,,,320900000A1139,,,,,,,,,,,,,0,1,Maison,145,5,AG,terrains d'agrément,,,2032,0.999839,43.566869
2020-419563,2020-11-05,000001,Vente,346200,1,,LOT LA PEYRADE,A010,32490,32090,Castillon-Savès,32,,,320900000A1139,,,,,,,,,,,,,0,3,Dépendance,,0,S,sols,,,1000,0.999839,43.566869
2020-419563,2020-11-05,000001,Vente,346200,1,,LOT LA PEYRADE,A010,32490,32090,Castillon-Savès,32,,,320900000A1139,,,,,,,,,,,,,0,1,Maison,145,5,S,sols,,,1000,0.999839,43.566869
2020-419563,2020-11-05,000001,Vente,346200,1,,LOT LA PEYRADE,A010,32490,32090,Castillon-Savès,32,,,320900000A1139,,,,,,,,,,,,,0,3,Dépendance,,0,AG,terrains d'agrément,,,2032,0.999839,43.566869
2020-420126,2020-12-11,000001,Vente,200000,5004,,A ENCONQUET,B012,32490,32090,Castillon-Savès,32,,,320900000A0117,,,,,,,,,,,,,0,1,Maison,230,5,S,sols,,,3950,0.978394,43.575708
2020-420126,2020-12-11,000001,Vente,200000,,,A ENCONQUET,B012,32490,32090,Castillon-Savès,32,,,320900000A0122,,,,,,,,,,,,,0,,,,,T,terres,,,1025,0.977771,43.575893
2020-420126,2020-12-11,000001,Vente,200000,,,A ENCONQUET,B012,32490,32090,Castillon-Savès,32,,,320900000A0123,,,,,,,,,,,,,0,,,,,T,terres,,,265,0.977671,43.575932
