id_mutation,date_mutation,numero_disposition,nature_mutation,valeur_fonciere,adresse_numero,adresse_suffixe,adresse_nom_voie,adresse_code_voie,code_postal,code_commune,nom_commune,code_departement,ancien_code_commune,ancien_nom_commune,id_parcelle,ancien_id_parcelle,numero_volume,lot1_numero,lot1_surface_carrez,lot2_numero,lot2_surface_carrez,lot3_numero,lot3_surface_carrez,lot4_numero,lot4_surface_carrez,lot5_numero,lot5_surface_carrez,nombre_lots,code_type_local,type_local,surface_reelle_bati,nombre_pieces_principales,code_nature_culture,nature_culture,code_nature_culture_speciale,nature_culture_speciale,surface_terrain,longitude,latitude
2020-415777,2020-01-22,000001,Vente,42000,,,A LA BOURDETTE,B018,32200,32123,Escornebœuf,32,,,321230000A0139,,,,,,,,,,,,,0,,,,,T,terres,,,6620,0.865086,43.647839
2020-415777,2020-01-22,000001,Vente,42000,,,A LA BOURDETTE,B018,32200,32123,Escornebœuf,32,,,321230000A0140,,,,,,,,,,,,,0,,,,,P,prés,,,6392,0.865481,43.647009
2020-415777,2020-01-22,000001,Vente,42000,,,A LA BOURDETTE,B018,32200,32123,Escornebœuf,32,,,321230000A0141,,,,,,,,,,,,,0,,,,,P,prés,,,3161,0.865956,43.646147
2020-415777,2020-01-22,000001,Vente,42000,,,A LA BOURDETTE,B018,32200,32123,Escornebœuf,32,,,321230000A0142,,,,,,,,,,,,,0,,,,,L,landes,,,1518,0.865246,43.646501
2020-415777,2020-01-22,000001,Vente,42000,,,A LA BOURDETTE,B018,32200,32123,Escornebœuf,32,,,321230000A0143,,,,,,,,,,,,,0,,,,,P,prés,,,675,0.864827,43.646576
2020-415777,2020-01-22,000001,Vente,42000,,,A LA BOURDETTE,B018,32200,32123,Escornebœuf,32,,,321230000A0144,,,,,,,,,,,,,0,,,,,T,terres,,,2340,0.864851,43.647207
2020-415777,2020-01-22,000001,Vente,42000,,,A LA BOURDETTE,B018,32200,32123,Escornebœuf,32,,,321230000A0145,,,,,,,,,,,,,0,,,,,T,terres,,,4390,0.86445,43.646942
2020-415777,2020-01-22,000001,Vente,42000,,,A LA COTE DU HAS,B036,32200,32123,Escornebœuf,32,,,321230000A0555,,,,,,,,,,,,,0,,,,,P,prés,,,7500,0.863559,43.6445
2020-415777,2020-01-22,000001,Vente,42000,,,A LA COTE DU HAS,B036,32200,32123,Escornebœuf,32,,,321230000A0556,,,,,,,,,,,,,0,,,,,T,terres,,,26520,0.863871,43.645754
2020-416037,2020-02-14,000001,Vente,40000,7,,LOT DES TILLEULS,A004,32200,32123,Escornebœuf,32,,,321230000C0395,,,,,,,,,,,,,0,1,Maison,119,4,AG,terrains d'agrément,,,1000,0.916357,43.652784
2020-416037,2020-02-14,000001,Vente,40000,7,,LOT DES TILLEULS,A004,32200,32123,Escornebœuf,32,,,321230000C0395,,,,,,,,,,,,,0,1,Maison,119,4,S,sols,,,723,0.916357,43.652784
2020-416191,2020-02-19,000001,Vente,295000,84,,CHEM DE BRAMEPAN,0010,32200,32123,Escornebœuf,32,,,321230000D0188,,,,,,,,,,,,,0,1,Maison,141,5,S,sols,,,1626,0.935937,43.65668
2020-416191,2020-02-19,000001,Vente,295000,5126,A,A LAS PETARRADES,B082,32200,32123,Escornebœuf,32,,,321230000D1035,,,,,,,,,,,,,0,4,Local industriel. commercial ou assimilé,,0,T,terres,,,2525,0.935461,43.656877
2020-416191,2020-02-19,000001,Vente,295000,5126,A,A LAS PETARRADES,B082,32200,32123,Escornebœuf,32,,,321230000D1035,,,,,,,,,,,,,0,4,Local industriel. commercial ou assimilé,,0,S,sols,,,5,0.935461,43.656877
2020-416191,2020-02-19,000001,Vente,295000,,,A LAS PETARRADES,B082,32200,32123,Escornebœuf,32,,,321230000D1037,,,,,,,,,,,,,0,,,,,T,terres,,,96,0.936027,43.656562
2020-416584,2020-02-20,000001,Vente,198000,273,,CHEM D'EN SARRADE,0120,32200,32123,Escornebœuf,32,,,321230000A0695,,,,,,,,,,,,,0,1,Maison,118,4,T,terres,,,2035,0.870894,43.638024
2020-416584,2020-02-20,000001,Vente,198000,273,,CHEM D'EN SARRADE,0120,32200,32123,Escornebœuf,32,,,321230000A0695,,,,,,,,,,,,,0,1,Maison,118,4,S,sols,,,965,0.870894,43.638024
2020-417754,2020-07-22,000001,Vente,433702,1173,,CHEM DE L'EGLISE DE SAINT JEAN,0045,32200,32123,Escornebœuf,32,,,321230000A0459,,,,,,,,,,,,,0,1,Maison,247,6,S,sols,,,2000,0.87001,43.639169
2020-417754,2020-07-22,000001,Vente,433702,1173,,CHEM DE L'EGLISE DE SAINT JEAN,0045,32200,32123,Escornebœuf,32,,,321230000A0459,,,,,,,,,,,,,0,1,Maison,247,6,AG,terrains d'agrément,,,3510,0.87001,43.639169
2020-418438,2020-09-03,000001,Vente,13000,,,AU PLANTE,B112,32200,32123,Escornebœuf,32,,,321230000D1021,,,,,,,,,,,,,0,,,,,T,terres,,,18333,0.950405,43.640212
2020-418456,2020-09-14,000001,Vente,250650,,,AU CLAOUS,B034,32200,32123,Escornebœuf,32,,,321230000A0528,,,,,,,,,,,,,0,,,,,T,terres,,,575,0.873709,43.640341
2020-418456,2020-09-14,000001,Vente,250650,810,,CHEM DE L'EGLISE DE SAINT JEAN,0045,32200,32123,Escornebœuf,32,,,321230000A0709,,,,,,,,,,,,,0,1,Maison,116,5,AG,terrains d'agrément,,,866,0.873573,43.6405
2020-418456,2020-09-14,000001,Vente,250650,810,,CHEM DE L'EGLISE DE SAINT JEAN,0045,32200,32123,Escornebœuf,32,,,321230000A0709,,,,,,,,,,,,,0,1,Maison,116,5,S,sols,,,1000,0.873573,43.6405
2020-418456,2020-09-14,000001,Vente,250650,,,AU CLAOUS,B034,32200,32123,Escornebœuf,32,,,321230000A0717,,,,,,,,,,,,,0,,,,,T,terres,,,327,0.873863,43.640715
2020-418835,2020-09-30,000001,Vente,296600,616,,CHEM DU HAS,0065,32200,32123,Escornebœuf,32,,,321230000A0838,,,,,,,,,,,,,0,1,Maison,200,6,S,sols,,,5000,0.87157,43.646923
2020-418835,2020-09-30,000001,Vente,296600,616,,CHEM DU HAS,0065,32200,32123,Escornebœuf,32,,,321230000A0838,,,,,,,,,,,,,0,1,Maison,200,6,AG,terrains d'agrément,,,5000,0.87157,43.646923
2020-418835,2020-09-30,000001,Vente,296600,616,,CHEM DU HAS,0065,32200,32123,Escornebœuf,32,,,321230000A0838,,,,,,,,,,,,,0,1,Maison,200,6,AG,terrains d'agrément,,,12955,0.87157,43.646923
