id_mutation,date_mutation,numero_disposition,nature_mutation,valeur_fonciere,adresse_numero,adresse_suffixe,adresse_nom_voie,adresse_code_voie,code_postal,code_commune,nom_commune,code_departement,ancien_code_commune,ancien_nom_commune,id_parcelle,ancien_id_parcelle,numero_volume,lot1_numero,lot1_surface_carrez,lot2_numero,lot2_surface_carrez,lot3_numero,lot3_surface_carrez,lot4_numero,lot4_surface_carrez,lot5_numero,lot5_surface_carrez,nombre_lots,code_type_local,type_local,surface_reelle_bati,nombre_pieces_principales,code_nature_culture,nature_culture,code_nature_culture_speciale,nature_culture_speciale,surface_terrain,longitude,latitude
2020-417180,2020-05-14,000001,Vente,31000,,,A LANCON,B018,32700,32176,Lagarde,32,,,32176000AK0148,,,,,,,,,,,,,0,,,,,T,terres,,,3,0.559294,43.959217
2020-417180,2020-05-14,000001,Vente,31000,,,A LANCON,B018,32700,32176,Lagarde,32,,,32176000AK0150,,,,,,,,,,,,,0,,,,,T,terres,,,1249,0.558173,43.958761
2020-417180,2020-05-14,000001,Vente,31000,,,A LANCON,B018,32700,32176,Lagarde,32,,,32176000AK0152,,,,,,,,,,,,,0,,,,,T,terres,,,1249,0.558596,43.959052
2020-419129,2020-10-22,000001,Vente,196500,18,,A HOURTOUNET,B015,32700,32176,Lagarde,32,,,32176000AI0141,,,,,,,,,,,,,0,1,Maison,240,7,S,sols,,,4417,0.564851,43.955369
2020-419129,2020-10-22,000001,Vente,196500,,,LES BAQUANS,B004,32700,32176,Lagarde,32,,,32176000AK0099,,,,,,,,,,,,,0,,,,,P,prés,,,3050,0.564149,43.955393
2020-419129,2020-10-22,000001,Vente,196500,,,LES BAQUANS,B004,32700,32176,Lagarde,32,,,32176000AK0100,,,,,,,,,,,,,0,,,,,P,prés,,,985,0.564729,43.954809
2020-419129,2020-10-22,000001,Vente,196500,,,LES BAQUANS,B004,32700,32176,Lagarde,32,,,32176000AK0101,,,,,,,,,,,,,0,,,,,T,terres,,,10355,0.565235,43.954104
2020-420189,2020-12-22,000002,Vente,198000,33,,A GOUDIN,B013,32700,32176,Lagarde,32,,,32176000AE0052,,,,,,,,,,,,,0,1,Maison,132,4,T,terres,,,3920,0.569134,43.96823
2020-420189,2020-12-22,000002,Vente,198000,33,,A GOUDIN,B013,32700,32176,Lagarde,32,,,32176000AE0052,,,,,,,,,,,,,0,1,Maison,132,4,S,sols,,,2000,0.569134,43.96823
2020-420189,2020-12-22,000002,Vente,198000,,,A GOUDIN,B013,32700,32176,Lagarde,32,,,32176000AE0165,,,,,,,,,,,,,0,,,,,P,prés,,,1737,0.569903,43.968222
2020-420189,2020-12-22,000002,Vente,198000,,,A GOUDIN,B013,32700,32176,Lagarde,32,,,32176000AE0167,,,,,,,,,,,,,0,,,,,P,prés,,,697,0.570133,43.968424
