id_mutation,date_mutation,numero_disposition,nature_mutation,valeur_fonciere,adresse_numero,adresse_suffixe,adresse_nom_voie,adresse_code_voie,code_postal,code_commune,nom_commune,code_departement,ancien_code_commune,ancien_nom_commune,id_parcelle,ancien_id_parcelle,numero_volume,lot1_numero,lot1_surface_carrez,lot2_numero,lot2_surface_carrez,lot3_numero,lot3_surface_carrez,lot4_numero,lot4_surface_carrez,lot5_numero,lot5_surface_carrez,nombre_lots,code_type_local,type_local,surface_reelle_bati,nombre_pieces_principales,code_nature_culture,nature_culture,code_nature_culture_speciale,nature_culture_speciale,surface_terrain,longitude,latitude
2020-416407,2020-02-24,000001,Vente,8000,5051,,A LA VILLE,B120,32190,32190,Lannepax,32,,,321900000E0302,,,,,,,,,,,,,0,1,Maison,58,3,S,sols,,,51,0.227571,43.799654
2020-416598,2020-03-27,000001,Vente,7000,,,A ARNAUTE,B002,32190,32190,Lannepax,32,,,321900000D0210,,,,,,,,,,,,,0,,,,,T,terres,,,2725,0.237871,43.796824
2020-416598,2020-03-27,000001,Vente,7000,,,A ARNAUTE,B002,32190,32190,Lannepax,32,,,321900000D0247,,,,,,,,,,,,,0,,,,,T,terres,,,6146,0.238444,43.796701
2020-416616,2020-03-27,000001,Vente,191900,5403,,AU POUY,B102,32190,32190,Lannepax,32,,,321900000D0914,,,,,,,,,,,,,0,1,Maison,133,5,S,sols,,,2000,0.231305,43.776601
2020-416616,2020-03-27,000001,Vente,191900,5403,,AU POUY,B102,32190,32190,Lannepax,32,,,321900000D0914,,,,,,,,,,,,,0,1,Maison,133,5,P,prés,,,6280,0.231305,43.776601
2020-417170,2020-06-05,000001,Vente,8000,,,AU PONT DE LAOUARDE,B098,32190,32190,Lannepax,32,,,321900000C0986,,,,,,,,,,,,,0,,,,,BP,peupleraies,,,9278,0.259922,43.785415
2020-417170,2020-06-05,000001,Vente,8000,,,AU PONT DE LAOUARDE,B098,32190,32190,Lannepax,32,,,321900000C0987,,,,,,,,,,,,,0,,,,,BP,peupleraies,,,6960,0.259995,43.784668
2020-417468,2020-06-25,000001,Vente,107000,,,AU LACA,B061,32190,32190,Lannepax,32,,,321900000B0618,,,,,,,,,,,,,0,,,,,VI,vignes,,,4830,0.240312,43.828602
2020-417468,2020-06-25,000001,Vente,107000,,,AU LACA,B061,32190,32190,Lannepax,32,,,321900000B0618,,,,,,,,,,,,,0,,,,,T,terres,,,6720,0.240312,43.828602
2020-417468,2020-06-25,000001,Vente,107000,,,A COQUESALLE,B030,32190,32190,Lannepax,32,,,321900000B0799,,,,,,,,,,,,,0,,,,,BT,taillis simples,,,548,0.234738,43.824999
2020-417468,2020-06-25,000001,Vente,107000,,,A COQUESALLE,B030,32190,32190,Lannepax,32,,,321900000B0823,,,,,,,,,,,,,0,,,,,BT,taillis simples,,,4740,0.24006,43.824547
2020-417468,2020-06-25,000001,Vente,107000,,,A COQUESALLE,B030,32190,32190,Lannepax,32,,,321900000B0824,,,,,,,,,,,,,0,,,,,BT,taillis simples,,,620,0.239832,43.823614
2020-417468,2020-06-25,000001,Vente,107000,,,A COQUESALLE,B030,32190,32190,Lannepax,32,,,321900000B1086,,,,,,,,,,,,,0,,,,,P,prés,,,33217,0.235648,43.825584
2020-417468,2020-06-25,000001,Vente,107000,,,A COQUESALLE,B030,32190,32190,Lannepax,32,,,321900000B1087,,,,,,,,,,,,,0,,,,,P,prés,,,53034,0.23789,43.825431
2020-417468,2020-06-25,000001,Vente,107000,,,A COQUESALLE,B030,32190,32190,Lannepax,32,,,321900000B1088,,,,,,,,,,,,,0,,,,,T,terres,,,34624,0.240875,43.825261
2020-417468,2020-06-25,000001,Vente,107000,,,A COQUESALLE,B030,32190,32190,Lannepax,32,,,321900000B1089,,,,,,,,,,,,,0,,,,,T,terres,,,42264,0.238865,43.823622
2020-417529,2020-06-09,000001,Vente,80000,5132,,A LA GARE,B042,32190,32190,Lannepax,32,,,321900000E1116,,,,,,,,,,,,,0,1,Maison,67,4,J,jardins,,,430,0.225762,43.797115
2020-417529,2020-06-09,000001,Vente,80000,5132,,A LA GARE,B042,32190,32190,Lannepax,32,,,321900000E1116,,,,,,,,,,,,,0,1,Maison,67,4,S,sols,,,580,0.225762,43.797115
2020-417739,2020-05-20,000001,Vente,360000,,,A GAJAN,B039,32190,32190,Lannepax,32,,,321900000C0503,,,,,,,,,,,,,0,,,,,P,prés,,,23150,0.258498,43.807982
2020-417739,2020-05-20,000001,Vente,360000,,,A GAJAN,B039,32190,32190,Lannepax,32,,,321900000C0504,,,,,,,,,,,,,0,,,,,P,prés,,,780,0.25714,43.807936
2020-417739,2020-05-20,000001,Vente,360000,,,A GAJAN,B039,32190,32190,Lannepax,32,,,321900000C0505,,,,,,,,,,,,,0,,,,,P,prés,,,232,0.256844,43.808375
2020-417739,2020-05-20,000001,Vente,360000,5239,,A GAJAN,B039,32190,32190,Lannepax,32,,,321900000C0507,,,,,,,,,,,,,0,1,Maison,159,6,S,sols,,,5360,0.2564,43.808002
2020-417739,2020-05-20,000001,Vente,360000,5239,,A GAJAN,B039,32190,32190,Lannepax,32,,,321900000C0507,,,,,,,,,,,,,0,4,Local industriel. commercial ou assimilé,350,0,S,sols,,,5360,0.2564,43.808002
2020-417739,2020-05-20,000001,Vente,360000,,,A GAJAN,B039,32190,32190,Lannepax,32,,,321900000C0508,,,,,,,,,,,,,0,,,,,E,eaux,MARE,Mare,1280,0.256363,43.807683
2020-417739,2020-05-20,000001,Vente,360000,,,A GAJAN,B039,32190,32190,Lannepax,32,,,321900000C0510,,,,,,,,,,,,,0,,,,,L,landes,,,1380,0.256233,43.807563
2020-417739,2020-05-20,000001,Vente,360000,,,A GAJAN,B039,32190,32190,Lannepax,32,,,321900000C0511,,,,,,,,,,,,,0,,,,,P,prés,,,5316,0.256598,43.807447
2020-417739,2020-05-20,000001,Vente,360000,,,A GAJAN,B039,32190,32190,Lannepax,32,,,321900000C0512,,,,,,,,,,,,,0,,,,,P,prés,,,6208,0.256988,43.806812
2020-417739,2020-05-20,000001,Vente,360000,,,A GAJAN,B039,32190,32190,Lannepax,32,,,321900000C0513,,,,,,,,,,,,,0,,,,,P,prés,,,7332,0.257379,43.807221
2020-417739,2020-05-20,000001,Vente,360000,,,A GAJAN,B039,32190,32190,Lannepax,32,,,321900000C0517,,,,,,,,,,,,,0,,,,,J,jardins,,,1155,0.255638,43.807456
2020-417739,2020-05-20,000001,Vente,360000,,,A GAJAN,B039,32190,32190,Lannepax,32,,,321900000C0518,,,,,,,,,,,,,0,,,,,J,jardins,,,649,0.255375,43.807662
2020-417739,2020-05-20,000001,Vente,360000,,,A GAJAN,B039,32190,32190,Lannepax,32,,,321900000C0519,,,,,,,,,,,,,0,,,,,BT,taillis simples,,,1324,0.255465,43.80778
2020-419022,2020-10-27,000001,Vente,11600,,,A LA VILLE,B120,32190,32190,Lannepax,32,,,321900000E1056,,,,,,,,,,,,,0,,,,,T,terres,,,4843,0.229893,43.79962
2020-419022,2020-10-27,000001,Vente,11600,,,A LA VILLE,B120,32190,32190,Lannepax,32,,,321900000E1123,,,,,,,,,,,,,0,,,,,S,sols,,,164,0.229347,43.799673
2020-419470,2020-11-21,000001,Vente,6000,,,A LA VILLE,B120,32190,32190,Lannepax,32,,,321900000E0157,,,,,,,,,,,,,0,,,,,J,jardins,,,535,0.228545,43.801353
2020-419528,2020-11-20,000001,Vente,1500,,,AU MOULIOT,B085,32190,32190,Lannepax,32,,,321900000E0455,,,,,,,,,,,,,0,,,,,J,jardins,,,993,0.223289,43.798308
2020-419528,2020-11-20,000001,Vente,1500,,,AU MOULIOT,B085,32190,32190,Lannepax,32,,,321900000E0458,,,,,,,,,,,,,0,,,,,T,terres,,,410,0.223045,43.797952
2020-419528,2020-11-20,000001,Vente,1500,,,AU MOULIOT,B085,32190,32190,Lannepax,32,,,321900000E0459,,,,,,,,,,,,,0,,,,,T,terres,,,820,0.222688,43.798186
2020-419528,2020-11-20,000001,Vente,1500,,,AU MOULIOT,B085,32190,32190,Lannepax,32,,,321900000E0459,,,,,,,,,,,,,0,,,,,VI,vignes,,,2052,0.222688,43.798186
2020-419829,2020-12-04,000001,Vente,40000,5053,,A LA VILLE,B120,32190,32190,Lannepax,32,,,321900000E0300,,,,,,,,,,,,,0,1,Maison,120,4,S,sols,,,425,0.227337,43.799563
