id_mutation,date_mutation,numero_disposition,nature_mutation,valeur_fonciere,adresse_numero,adresse_suffixe,adresse_nom_voie,adresse_code_voie,code_postal,code_commune,nom_commune,code_departement,ancien_code_commune,ancien_nom_commune,id_parcelle,ancien_id_parcelle,numero_volume,lot1_numero,lot1_surface_carrez,lot2_numero,lot2_surface_carrez,lot3_numero,lot3_surface_carrez,lot4_numero,lot4_surface_carrez,lot5_numero,lot5_surface_carrez,nombre_lots,code_type_local,type_local,surface_reelle_bati,nombre_pieces_principales,code_nature_culture,nature_culture,code_nature_culture_speciale,nature_culture_speciale,surface_terrain,longitude,latitude
2020-416077,2020-01-23,000001,Vente,99380,8,,CHEM DU LAC,0030,32140,32365,Saint-Blancard,32,,,323650000C0739,,,,,,,,,,,,,0,1,Maison,32,1,T,terres,,,2503,0.656361,43.337631
2020-416357,2020-03-05,000001,Vente,11000,,,AU LUGRET,B020,32140,32365,Saint-Blancard,32,,,323650000B0389,,,,,,,,,,,,,0,,,,,BT,taillis simples,,,16440,0.663655,43.352141
2020-416357,2020-03-05,000001,Vente,11000,,,AU LUGRET,B020,32140,32365,Saint-Blancard,32,,,323650000B0396,,,,,,,,,,,,,0,,,,,L,landes,,,3110,0.663521,43.353152
2020-416357,2020-03-05,000001,Vente,11000,,,AU LUGRET,B020,32140,32365,Saint-Blancard,32,,,323650000B0397,,,,,,,,,,,,,0,,,,,BT,taillis simples,,,11410,0.665122,43.353014
2020-416386,2020-03-02,000002,Echange,500,,,AU LUGRET,B020,32140,32365,Saint-Blancard,32,,,323650000B1100,,,,,,,,,,,,,0,,,,,P,prés,,,852,0.662896,43.348631
2020-416386,2020-03-02,000003,Echange,500,,,AU LUGRET,B020,32140,32365,Saint-Blancard,32,,,323650000B1098,,,,,,,,,,,,,0,,,,,T,terres,,,901,0.662348,43.349076
2020-416445,2020-03-10,000002,Vente,86900,15,,QUA DU COMMERCE,A040,32140,32365,Saint-Blancard,32,,,323650000B0314,,,,,,,,,,,,,0,1,Maison,130,5,S,sols,,,120,0.650059,43.34407
2020-418798,2020-09-29,000001,Vente,7500,,,A LAS ANGLADOS,B015,32140,32365,Saint-Blancard,32,,,323650000B0984,,,,,,,,,,,,,0,,,,,T,terres,,,12774,0.684986,43.346866
2020-419629,2020-11-27,000001,Vente,172370,34,,QUA PADOUENT,A080,32140,32365,Saint-Blancard,32,,,323650000B1020,,,,,,,,,,,,,0,1,Maison,123,4,S,sols,,,1000,0.653978,43.343537
2020-419629,2020-11-27,000001,Vente,172370,34,,QUA PADOUENT,A080,32140,32365,Saint-Blancard,32,,,323650000B1020,,,,,,,,,,,,,0,1,Maison,123,4,P,prés,,,377,0.653978,43.343537
2020-419631,2020-11-30,000001,Vente,115000,5009,,AU CHATEAU,B011,32140,32365,Saint-Blancard,32,,,323650000C0022,,,,,,,,,,,,,0,1,Maison,250,9,S,sols,,,920,0.641425,43.344329
2020-419631,2020-11-30,000001,Vente,115000,,,AU CHATEAU,B011,32140,32365,Saint-Blancard,32,,,323650000C0374,,,,,,,,,,,,,0,,,,,J,jardins,,,624,0.641782,43.34438
2020-419631,2020-11-30,000001,Vente,115000,,,AU CHATEAU,B011,32140,32365,Saint-Blancard,32,,,323650000C0380,,,,,,,,,,,,,0,,,,,T,terres,,,2327,0.640949,43.344154
2020-419631,2020-11-30,000001,Vente,115000,,,AU CHATEAU,B011,32140,32365,Saint-Blancard,32,,,323650000C0709,,,,,,,,,,,,,0,,,,,P,prés,,,2307,0.641649,43.34408
2020-420165,2020-12-15,000001,Vente,146000,,,AU LUGRET,B020,32140,32365,Saint-Blancard,32,,,323650000B0371,,,,,,,,,,,,,0,,,,,J,jardins,,,500,0.662291,43.348639
2020-420165,2020-12-15,000001,Vente,146000,,,AU LUGRET,B020,32140,32365,Saint-Blancard,32,,,323650000B0372,,,,,,,,,,,,,0,,,,,J,jardins,,,1160,0.662607,43.348692
2020-420165,2020-12-15,000001,Vente,146000,5071,,AU LUGRET,B020,32140,32365,Saint-Blancard,32,,,323650000B0373,,,,,,,,,,,,,0,1,Maison,155,5,S,sols,,,2490,0.66241,43.348357
2020-420165,2020-12-15,000001,Vente,146000,,,AU LUGRET,B020,32140,32365,Saint-Blancard,32,,,323650000B0375,,,,,,,,,,,,,0,,,,,P,prés,,,2960,0.663157,43.348193
2020-420165,2020-12-15,000001,Vente,146000,,,AU LUGRET,B020,32140,32365,Saint-Blancard,32,,,323650000B1099,,,,,,,,,,,,,0,,,,,T,terres,,,889,0.662447,43.348857
2020-420165,2020-12-15,000001,Vente,146000,,,AU LUGRET,B020,32140,32365,Saint-Blancard,32,,,323650000B1100,,,,,,,,,,,,,0,,,,,S,sols,,,852,0.662896,43.348631
