id_mutation,date_mutation,numero_disposition,nature_mutation,valeur_fonciere,adresse_numero,adresse_suffixe,adresse_nom_voie,adresse_code_voie,code_postal,code_commune,nom_commune,code_departement,ancien_code_commune,ancien_nom_commune,id_parcelle,ancien_id_parcelle,numero_volume,lot1_numero,lot1_surface_carrez,lot2_numero,lot2_surface_carrez,lot3_numero,lot3_surface_carrez,lot4_numero,lot4_surface_carrez,lot5_numero,lot5_surface_carrez,nombre_lots,code_type_local,type_local,surface_reelle_bati,nombre_pieces_principales,code_nature_culture,nature_culture,code_nature_culture_speciale,nature_culture_speciale,surface_terrain,longitude,latitude
2020-417324,2020-06-15,000001,Vente,185000,453,,RTE D'EN GALAUBET,0095,32120,32416,Sarrant,32,,,32416000ZE0010,,,,,,,,,,,,,0,1,Maison,102,4,T,terres,,,1050,0.92222,43.774686
2020-417324,2020-06-15,000001,Vente,185000,453,,RTE D'EN GALAUBET,0095,32120,32416,Sarrant,32,,,32416000ZE0010,,,,,,,,,,,,,0,1,Maison,102,4,S,sols,,,1463,0.92222,43.774686
2020-417324,2020-06-15,000001,Vente,185000,453,,RTE D'EN GALAUBET,0095,32120,32416,Sarrant,32,,,32416000ZE0010,,,,,,,,,,,,,0,3,Dépendance,,0,T,terres,,,1050,0.92222,43.774686
2020-417324,2020-06-15,000001,Vente,185000,453,,RTE D'EN GALAUBET,0095,32120,32416,Sarrant,32,,,32416000ZE0010,,,,,,,,,,,,,0,3,Dépendance,,0,S,sols,,,1463,0.92222,43.774686
2020-418205,2020-08-25,000001,Vente,83884,1,,RUE DU BARRY,0025,32120,32416,Sarrant,32,,,324160000A0669,,,,,,,,,,,,,0,3,Dépendance,,0,S,sols,,,61,0.929881,43.774627
2020-418205,2020-08-25,000001,Vente,83884,1,,RUE DU BARRY,0025,32120,32416,Sarrant,32,,,324160000A0669,,,,,,,,,,,,,0,1,Maison,100,5,S,sols,,,61,0.929881,43.774627
2020-418315,2020-08-11,000001,Vente,40995.88,,,A EMPAYRASSON,B023,32120,32416,Sarrant,32,,,32416000ZE0051,,,,,,,,,,,,,0,,,,,BT,taillis simples,,,3036,0.921054,43.774298
2020-418315,2020-08-11,000001,Vente,40995.88,,,A EMPAYRASSON,B023,32120,32416,Sarrant,32,,,32416000ZE0051,,,,,,,,,,,,,0,,,,,T,terres,,,43699,0.921054,43.774298
2020-418315,2020-08-11,000001,Vente,40995.88,,,A EMPAYRASSON,B023,32120,32416,Sarrant,32,,,32416000ZE0051,,,,,,,,,,,,,0,,,,,T,terres,,,21849,0.921054,43.774298
2020-418953,2020-10-21,000001,Vente,120000,,,A SEDAIL,B072,32120,32416,Sarrant,32,,,32416000ZI0041,,,,,,,,,,,,,0,,,,,E,eaux,,,994,0.929048,43.776632
2020-418953,2020-10-21,000001,Vente,120000,,,A SEDAIL,B072,32120,32416,Sarrant,32,,,32416000ZI0041,,,,,,,,,,,,,0,,,,,P,prés,,,18256,0.929048,43.776632
2020-418953,2020-10-21,000001,Vente,120000,,,A SEDAIL,B072,32120,32416,Sarrant,32,,,32416000ZI0041,,,,,,,,,,,,,0,,,,,E,eaux,,,590,0.929048,43.776632
2020-418953,2020-10-21,000001,Vente,120000,240,,RTE DE SOLOMIAC,0215,32120,32416,Sarrant,32,,,32416000ZI0042,,,,,,,,,,,,,0,1,Maison,28,1,S,sols,,,500,0.928526,43.776809
2020-418953,2020-10-21,000001,Vente,120000,240,,RTE DE SOLOMIAC,0215,32120,32416,Sarrant,32,,,32416000ZI0042,,,,,,,,,,,,,0,1,Maison,28,1,T,terres,,,9500,0.928526,43.776809
2020-419139,2020-10-23,000001,Vente,5000,,,A ENGARDIAN,B030,32120,32416,Sarrant,32,,,32416000ZT0049,,,,,,,,,,,,,0,,,,,T,terres,,,5316,0.910881,43.754845
2020-419139,2020-10-23,000001,Vente,5000,,,A ENGARDIAN,B030,32120,32416,Sarrant,32,,,32416000ZT0053,,,,,,,,,,,,,0,,,,,S,sols,,,2372,0.911552,43.754305
2020-419354,2020-11-06,000001,Vente,130000,,,A LA PRADE,B063,32120,32416,Sarrant,32,,,32416000ZC0001,,,,,,,,,,,,,0,,,,,P,prés,,,5620,0.898583,43.768546
2020-419354,2020-11-06,000001,Vente,130000,,,A LA PRADE,B063,32120,32416,Sarrant,32,,,32416000ZC0001,,,,,,,,,,,,,0,,,,,P,prés,,,5620,0.898583,43.768546
2020-419354,2020-11-06,000001,Vente,130000,,,A LA PRADE,B063,32120,32416,Sarrant,32,,,32416000ZC0002,,,,,,,,,,,,,0,,,,,P,prés,,,51500,0.89611,43.770039
2020-419354,2020-11-06,000001,Vente,130000,,,A LA PRADE,B063,32120,32416,Sarrant,32,,,32416000ZC0002,,,,,,,,,,,,,0,,,,,P,prés,,,51500,0.89611,43.770039
2020-419354,2020-11-06,000001,Vente,130000,,,AU QUICHOU,B064,32120,32416,Sarrant,32,,,32416000ZC0014,,,,,,,,,,,,,0,,,,,T,terres,,,13315,0.912419,43.7688
2020-419354,2020-11-06,000001,Vente,130000,,,AU QUICHOU,B064,32120,32416,Sarrant,32,,,32416000ZC0052,,,,,,,,,,,,,0,,,,,AB,terrains a bâtir,CHEM,Chemin (non groupe),156,0.904032,43.770507
2020-419354,2020-11-06,000001,Vente,130000,,,AU QUICHOU,B064,32120,32416,Sarrant,32,,,32416000ZC0053,,,,,,,,,,,,,0,,,,,BT,taillis simples,,,6190,0.903944,43.771097
2020-419354,2020-11-06,000001,Vente,130000,,,AU QUICHOU,B064,32120,32416,Sarrant,32,,,32416000ZC0053,,,,,,,,,,,,,0,,,,,T,terres,,,145178,0.903944,43.771097
2020-419354,2020-11-06,000001,Vente,130000,,,AU QUICHOU,B064,32120,32416,Sarrant,32,,,32416000ZC0053,,,,,,,,,,,,,0,,,,,T,terres,,,36000,0.903944,43.771097
2020-419354,2020-11-06,000001,Vente,130000,,,AU QUICHOU,B064,32120,32416,Sarrant,32,,,32416000ZC0053,,,,,,,,,,,,,0,,,,,BT,taillis simples,,,2222,0.903944,43.771097
2020-419354,2020-11-06,000001,Vente,130000,,,AU QUICHOU,B064,32120,32416,Sarrant,32,,,32416000ZC0054,,,,,,,,,,,,,0,,,,,T,terres,,,23145,0.90306,43.770031
2020-419354,2020-11-06,000001,Vente,130000,,,AU QUICHOU,B064,32120,32416,Sarrant,32,,,32416000ZC0054,,,,,,,,,,,,,0,,,,,BT,taillis simples,,,1030,0.90306,43.770031
2020-419354,2020-11-06,000001,Vente,130000,,,AU MOULIN VIEUX,B057,32120,32416,Sarrant,32,,,32416000ZE0001,,,,,,,,,,,,,0,,,,,T,terres,,,43735,0.914568,43.7698
