id_mutation,date_mutation,numero_disposition,nature_mutation,valeur_fonciere,adresse_numero,adresse_suffixe,adresse_nom_voie,adresse_code_voie,code_postal,code_commune,nom_commune,code_departement,ancien_code_commune,ancien_nom_commune,id_parcelle,ancien_id_parcelle,numero_volume,lot1_numero,lot1_surface_carrez,lot2_numero,lot2_surface_carrez,lot3_numero,lot3_surface_carrez,lot4_numero,lot4_surface_carrez,lot5_numero,lot5_surface_carrez,nombre_lots,code_type_local,type_local,surface_reelle_bati,nombre_pieces_principales,code_nature_culture,nature_culture,code_nature_culture_speciale,nature_culture_speciale,surface_terrain,longitude,latitude
2020-419526,2020-11-27,000001,Vente,240000,,,AU PRE DE L HOPITAL,B031,32260,32438,Tachoires,32,,,324380000B0216,,,,,,,,,,,,,0,,,,,E,eaux,MARE,Mare,1340,0.664403,43.47608
2020-419526,2020-11-27,000001,Vente,240000,,,AU PRE DE L HOPITAL,B031,32260,32438,Tachoires,32,,,324380000B0218,,,,,,,,,,,,,0,,,,,T,terres,,,1100,0.664992,43.475029
2020-419526,2020-11-27,000001,Vente,240000,,,AU PRE DE L HOPITAL,B031,32260,32438,Tachoires,32,,,324380000B0219,,,,,,,,,,,,,0,,,,,P,prés,,,2100,0.66539,43.474816
2020-419526,2020-11-27,000001,Vente,240000,5040,,AU PRE DE L HOPITAL,B031,32260,32438,Tachoires,32,,,324380000B0220,,,,,,,,,,,,,0,1,Maison,162,6,S,sols,,,980,0.664958,43.474805
2020-419526,2020-11-27,000001,Vente,240000,,,AU PRE DE L HOPITAL,B031,32260,32438,Tachoires,32,,,324380000B0221,,,,,,,,,,,,,0,,,,,P,prés,,,12005,0.66412,43.475045
2020-419526,2020-11-27,000001,Vente,240000,,,AU PRE DE L HOPITAL,B031,32260,32438,Tachoires,32,,,324380000B0222,,,,,,,,,,,,,0,,,,,P,prés,,,4590,0.663674,43.474759
2020-419526,2020-11-27,000001,Vente,240000,,,AU PRE DE L HOPITAL,B031,32260,32438,Tachoires,32,,,324380000B0223,,,,,,,,,,,,,0,,,,,P,prés,,,10525,0.663588,43.474407
2020-419526,2020-11-27,000001,Vente,240000,,,AU PRE DE L HOPITAL,B031,32260,32438,Tachoires,32,,,324380000B0224,,,,,,,,,,,,,0,,,,,T,terres,,,6950,0.663481,43.474035
2020-419526,2020-11-27,000001,Vente,240000,,,AU PRE DE L HOPITAL,B031,32260,32438,Tachoires,32,,,324380000B0228,,,,,,,,,,,,,0,,,,,L,landes,,,4320,0.664093,43.473723
2020-419526,2020-11-27,000001,Vente,240000,,,AU PRE DE L HOPITAL,B031,32260,32438,Tachoires,32,,,324380000B0229,,,,,,,,,,,,,0,,,,,E,eaux,MARE,Mare,1450,0.663989,43.473212
2020-419526,2020-11-27,000001,Vente,240000,,,AU PRE DE L HOPITAL,B031,32260,32438,Tachoires,32,,,324380000B0230,,,,,,,,,,,,,0,,,,,L,landes,,,480,0.663664,43.472582
2020-419526,2020-11-27,000001,Vente,240000,,,AU PRE DE L HOPITAL,B031,32260,32438,Tachoires,32,,,324380000B0234,,,,,,,,,,,,,0,,,,,P,prés,,,1024,0.664882,43.473739
2020-419526,2020-11-27,000001,Vente,240000,,,AU PRE DE L HOPITAL,B031,32260,32438,Tachoires,32,,,324380000B0234,,,,,,,,,,,,,0,,,,,E,eaux,MARE,Mare,536,0.664882,43.473739
2020-419526,2020-11-27,000001,Vente,240000,,,AU PRE DE L HOPITAL,B031,32260,32438,Tachoires,32,,,324380000B0235,,,,,,,,,,,,,0,,,,,E,eaux,MARE,Mare,1110,0.664726,43.474152
2020-419526,2020-11-27,000001,Vente,240000,,,AU PRE DE L HOPITAL,B031,32260,32438,Tachoires,32,,,324380000B0235,,,,,,,,,,,,,0,,,,,P,prés,,,1260,0.664726,43.474152
2020-419526,2020-11-27,000001,Vente,240000,,,AU PRE DE L HOPITAL,B031,32260,32438,Tachoires,32,,,324380000B0236,,,,,,,,,,,,,0,,,,,E,eaux,MARE,Mare,515,0.665132,43.47423
2020-419526,2020-11-27,000001,Vente,240000,,,AU PRE DE L HOPITAL,B031,32260,32438,Tachoires,32,,,324380000B0236,,,,,,,,,,,,,0,,,,,S,sols,,,1395,0.665132,43.47423
2020-419526,2020-11-27,000001,Vente,240000,,,A LA PATTE D OIE,B024,32260,32438,Tachoires,32,,,324380000B0497,,,,,,,,,,,,,0,,,,,E,eaux,MARE,Mare,120,0.662536,43.471461
2020-419526,2020-11-27,000001,Vente,240000,,,A LA PATTE D OIE,B024,32260,32438,Tachoires,32,,,324380000B0498,,,,,,,,,,,,,0,,,,,L,landes,,,660,0.662393,43.471531
2020-419526,2020-11-27,000001,Vente,240000,,,A LA PATTE D OIE,B024,32260,32438,Tachoires,32,,,324380000B0499,,,,,,,,,,,,,0,,,,,L,landes,,,600,0.662392,43.471665
2020-419526,2020-11-27,000001,Vente,240000,,,A LAS MURAILLOS,B019,32260,32438,Tachoires,32,,,324380000B0500,,,,,,,,,,,,,0,,,,,E,eaux,MARE,Mare,30,0.66265,43.471668
2020-419526,2020-11-27,000001,Vente,240000,,,A LA PATTE D OIE,B024,32260,32438,Tachoires,32,,,324380000B0536,,,,,,,,,,,,,0,,,,,P,prés,,,52,0.662838,43.471606
2020-419526,2020-11-27,000001,Vente,240000,,,A LA PATTE D OIE,B024,32260,32438,Tachoires,32,,,324380000B0538,,,,,,,,,,,,,0,,,,,P,prés,,,722,0.662596,43.471365
