id_mutation,date_mutation,numero_disposition,nature_mutation,valeur_fonciere,adresse_numero,adresse_suffixe,adresse_nom_voie,adresse_code_voie,code_postal,code_commune,nom_commune,code_departement,ancien_code_commune,ancien_nom_commune,id_parcelle,ancien_id_parcelle,numero_volume,lot1_numero,lot1_surface_carrez,lot2_numero,lot2_surface_carrez,lot3_numero,lot3_surface_carrez,lot4_numero,lot4_surface_carrez,lot5_numero,lot5_surface_carrez,nombre_lots,code_type_local,type_local,surface_reelle_bati,nombre_pieces_principales,code_nature_culture,nature_culture,code_nature_culture_speciale,nature_culture_speciale,surface_terrain,longitude,latitude
2020-417775,2020-07-23,000002,Vente,153000,5061,,A PETEMBELLE,B016,32230,32450,Tourdun,32,,,324500000B0473,,,,,,,,,,,,,0,1,Maison,94,4,,,,,,0.178627,43.547588
2020-419591,2020-11-20,000001,Vente,170350,5045,,A CALA,B005,32230,32450,Tourdun,32,,,324500000A0408,,,,,,,,,,,,,0,1,Maison,99,4,S,sols,,,500,0.150771,43.549207
2020-419591,2020-11-20,000001,Vente,170350,5045,,A CALA,B005,32230,32450,Tourdun,32,,,324500000A0408,,,,,,,,,,,,,0,1,Maison,99,4,J,jardins,,,940,0.150771,43.549207
2020-419591,2020-11-20,000001,Vente,170350,,,A CALA,B005,32230,32450,Tourdun,32,,,324500000A0533,,,,,,,,,,,,,0,,,,,T,terres,,,1537,0.151029,43.549441
2020-419928,2020-12-17,000001,Vente,18193,,,A NADAOU,B014,32230,32450,Tourdun,32,,,324500000A0082,,,,,,,,,,,,,0,,,,,T,terres,,,14950,0.138288,43.556341
2020-419928,2020-12-17,000001,Vente,18193,,,A NADAOU,B014,32230,32450,Tourdun,32,,,324500000A0083,,,,,,,,,,,,,0,,,,,T,terres,,,11040,0.140895,43.555964
2020-420051,2020-12-17,000001,Vente,173000,,,AU TINTURE,B020,32230,32450,Tourdun,32,,,324500000B0114,,,,,,,,,,,,,0,,,,,L,landes,,,2040,0.16282,43.5457
2020-420051,2020-12-17,000001,Vente,173000,,,AU TINTURE,B020,32230,32450,Tourdun,32,,,324500000B0115,,,,,,,,,,,,,0,,,,,L,landes,,,1570,0.16324,43.545313
2020-420051,2020-12-17,000001,Vente,173000,5029,,A LABISTE,B009,32230,32450,Tourdun,32,,,324500000C0158,,,,,,,,,,,,,0,1,Maison,102,5,S,sols,,,1411,0.163262,43.544878
2020-420051,2020-12-17,000001,Vente,173000,5029,,A LABISTE,B009,32230,32450,Tourdun,32,,,324500000C0158,,,,,,,,,,,,,0,1,Maison,90,3,S,sols,,,1411,0.163262,43.544878
2020-420051,2020-12-17,000001,Vente,173000,5059,,A LABISTE,B009,32230,32450,Tourdun,32,,,324500000C0159,,,,,,,,,,,,,0,1,Maison,50,3,S,sols,,,986,0.163255,43.544782
2020-420051,2020-12-17,000001,Vente,173000,5059,,A LABISTE,B009,32230,32450,Tourdun,32,,,324500000C0159,,,,,,,,,,,,,0,1,Maison,50,3,T,terres,,,3729,0.163255,43.544782
2020-420051,2020-12-17,000001,Vente,173000,,,A LABISTE,B009,32230,32450,Tourdun,32,,,324500000C0408,,,,,,,,,,,,,0,,,,,T,terres,,,391,0.16283,43.545114
2020-420051,2020-12-17,000001,Vente,173000,,,A SERRES,B018,32230,32450,Tourdun,32,,,324500000C0409,,,,,,,,,,,,,0,,,,,T,terres,,,27,0.162691,43.545108
2020-420051,2020-12-17,000001,Vente,173000,,,A SERRES,B018,32230,32450,Tourdun,32,,,324500000C0410,,,,,,,,,,,,,0,,,,,T,terres,,,64,0.162695,43.54498
