id_mutation,date_mutation,numero_disposition,nature_mutation,valeur_fonciere,adresse_numero,adresse_suffixe,adresse_nom_voie,adresse_code_voie,code_postal,code_commune,nom_commune,code_departement,ancien_code_commune,ancien_nom_commune,id_parcelle,ancien_id_parcelle,numero_volume,lot1_numero,lot1_surface_carrez,lot2_numero,lot2_surface_carrez,lot3_numero,lot3_surface_carrez,lot4_numero,lot4_surface_carrez,lot5_numero,lot5_surface_carrez,nombre_lots,code_type_local,type_local,surface_reelle_bati,nombre_pieces_principales,code_nature_culture,nature_culture,code_nature_culture_speciale,nature_culture_speciale,surface_terrain,longitude,latitude
2020-416997,2020-05-13,000001,Vente,30000,,,A HILLO,B010,32500,32457,Urdens,32,,,324570000E0373,,,,,,,,,,,,,0,,,,,AB,terrains a bâtir,,,1872,0.69656,43.85999
2020-416997,2020-05-13,000001,Vente,30000,,,A HILLO,B010,32500,32457,Urdens,32,,,324570000E0375,,,,,,,,,,,,,0,,,,,S,sols,,,126,0.697099,43.86015
2020-418910,2020-09-30,000001,Vente,80000,,,AU BIMOUAS,B006,32500,32457,Urdens,32,,,324570000B0091,,,,,,,,,,,,,0,,,,,E,eaux,LAC,Lac,3517,0.71643,43.866398
2020-418910,2020-09-30,000001,Vente,80000,,,AU BIMOUAS,B006,32500,32457,Urdens,32,,,324570000B0091,,,,,,,,,,,,,0,,,,,T,terres,,,1308,0.71643,43.866398
2020-418910,2020-09-30,000001,Vente,80000,,,AU BIMOUAS,B006,32500,32457,Urdens,32,,,324570000B0091,,,,,,,,,,,,,0,,,,,L,landes,,,1075,0.71643,43.866398
2020-418910,2020-09-30,000001,Vente,80000,,,AU BIMOUAS,B006,32500,32457,Urdens,32,,,324570000B0093,,,,,,,,,,,,,0,,,,,T,terres,,,3480,0.718033,43.865947
2020-418910,2020-09-30,000001,Vente,80000,,,AU BIMOUAS,B006,32500,32457,Urdens,32,,,324570000B0094,,,,,,,,,,,,,0,,,,,T,terres,,,5522,0.718132,43.866383
2020-418910,2020-09-30,000001,Vente,80000,,,AU BIMOUAS,B006,32500,32457,Urdens,32,,,324570000B0095,,,,,,,,,,,,,0,,,,,T,terres,,,2948,0.71793,43.866754
2020-418910,2020-09-30,000001,Vente,80000,,,AU BIMOUAS,B006,32500,32457,Urdens,32,,,324570000B0095,,,,,,,,,,,,,0,,,,,L,landes,,,538,0.71793,43.866754
2020-418910,2020-09-30,000001,Vente,80000,,,AU BIMOUAS,B006,32500,32457,Urdens,32,,,324570000B0095,,,,,,,,,,,,,0,,,,,E,eaux,LAC,Lac,264,0.71793,43.866754
2020-418910,2020-09-30,000001,Vente,80000,,,AU BIMOUAS,B006,32500,32457,Urdens,32,,,324570000B0096,,,,,,,,,,,,,0,,,,,T,terres,,,4020,0.720014,43.866392
2020-418910,2020-09-30,000001,Vente,80000,,,AU BIMOUAS,B006,32500,32457,Urdens,32,,,324570000B0115,,,,,,,,,,,,,0,,,,,T,terres,,,5850,0.717753,43.865128
2020-418910,2020-09-30,000001,Vente,80000,,,AU BIMOUAS,B006,32500,32457,Urdens,32,,,324570000B0116,,,,,,,,,,,,,0,,,,,T,terres,,,24981,0.716197,43.865394
2020-418910,2020-09-30,000001,Vente,80000,,,AU BIMOUAS,B006,32500,32457,Urdens,32,,,324570000B0116,,,,,,,,,,,,,0,,,,,E,eaux,LAC,Lac,1908,0.716197,43.865394
2020-418910,2020-09-30,000001,Vente,80000,,,AU BIMOUAS,B006,32500,32457,Urdens,32,,,324570000B0116,,,,,,,,,,,,,0,,,,,L,landes,,,366,0.716197,43.865394
2020-418910,2020-09-30,000001,Vente,80000,,,AU BIMOUAS,B006,32500,32457,Urdens,32,,,324570000B0117,,,,,,,,,,,,,0,,,,,T,terres,,,6420,0.715045,43.865269
2020-418910,2020-09-30,000001,Vente,80000,,,AU BIMOUAS,B006,32500,32457,Urdens,32,,,324570000B0122,,,,,,,,,,,,,0,,,,,BT,taillis simples,,,1606,0.71559,43.864618
2020-418910,2020-09-30,000001,Vente,80000,,,AU BIMOUAS,B006,32500,32457,Urdens,32,,,324570000B0123,,,,,,,,,,,,,0,,,,,BT,taillis simples,,,176,0.716668,43.864198
2020-418910,2020-09-30,000001,Vente,80000,,,AU BIMOUAS,B006,32500,32457,Urdens,32,,,324570000B0124,,,,,,,,,,,,,0,,,,,BT,taillis simples,,,892,0.716902,43.864168
2020-418910,2020-09-30,000001,Vente,80000,,,AU BIMOUAS,B006,32500,32457,Urdens,32,,,324570000B0125,,,,,,,,,,,,,0,,,,,BT,taillis simples,,,480,0.717157,43.864119
2020-418910,2020-09-30,000001,Vente,80000,,,AU BIMOUAS,B006,32500,32457,Urdens,32,,,324570000B0126,,,,,,,,,,,,,0,,,,,T,terres,,,2356,0.717681,43.864237
2020-418910,2020-09-30,000001,Vente,80000,,,AU BIMOUAS,B006,32500,32457,Urdens,32,,,324570000B0127,,,,,,,,,,,,,0,,,,,T,terres,,,8502,0.71666,43.863722
2020-418910,2020-09-30,000001,Vente,80000,,,AU BIMOUAS,B006,32500,32457,Urdens,32,,,324570000B0128,,,,,,,,,,,,,0,,,,,T,terres,,,6311,0.717752,43.863533
2020-418910,2020-09-30,000001,Vente,80000,,,AU BIMOUAS,B006,32500,32457,Urdens,32,,,324570000B0129,,,,,,,,,,,,,0,,,,,T,terres,,,6112,0.71868,43.864155
2020-418910,2020-09-30,000001,Vente,80000,,,AU BIMOUAS,B006,32500,32457,Urdens,32,,,324570000B0250,,,,,,,,,,,,,0,,,,,T,terres,,,1032,0.717226,43.86329
2020-418910,2020-09-30,000001,Vente,80000,,,AU BIMOUAS,B006,32500,32457,Urdens,32,,,324570000B0291,,,,,,,,,,,,,0,,,,,T,terres,,,4311,0.718627,43.864752
2020-418910,2020-09-30,000001,Vente,80000,,,AU BIMOUAS,B006,32500,32457,Urdens,32,,,324570000B0293,,,,,,,,,,,,,0,,,,,T,terres,,,10941,0.719416,43.865819
2020-418910,2020-09-30,000001,Vente,80000,,,AU BIMOUAS,B006,32500,32457,Urdens,32,,,324570000B0295,,,,,,,,,,,,,0,,,,,T,terres,,,9623,0.71774,43.865923
2020-418910,2020-09-30,000001,Vente,80000,,,AU BIMOUAS,B006,32500,32457,Urdens,32,,,324570000B0295,,,,,,,,,,,,,0,,,,,E,eaux,LAC,Lac,1620,0.71774,43.865923
2020-418910,2020-09-30,000001,Vente,80000,,,AU BIMOUAS,B006,32500,32457,Urdens,32,,,324570000B0295,,,,,,,,,,,,,0,,,,,L,landes,,,593,0.71774,43.865923
2020-419710,2020-12-08,000001,Vente,296000,,,A ARNAUD LANNE,B001,32500,32457,Urdens,32,,,324570000A0094,,,,,,,,,,,,,0,,,,,P,prés,,,696,0.691639,43.865963
2020-419710,2020-12-08,000001,Vente,296000,,,A ARNAUD LANNE,B001,32500,32457,Urdens,32,,,324570000A0095,,,,,,,,,,,,,0,,,,,J,jardins,,,430,0.692083,43.866036
2020-419710,2020-12-08,000001,Vente,296000,5036,,A ARNAUD LANNE,B001,32500,32457,Urdens,32,,,324570000A0096,,,,,,,,,,,,,0,1,Maison,238,6,S,sols,,,1507,0.692149,43.865773
2020-419710,2020-12-08,000001,Vente,296000,5036,,A ARNAUD LANNE,B001,32500,32457,Urdens,32,,,324570000A0096,,,,,,,,,,,,,0,1,Maison,238,6,J,jardins,,,1572,0.692149,43.865773
