id_mutation,date_mutation,numero_disposition,nature_mutation,valeur_fonciere,adresse_numero,adresse_suffixe,adresse_nom_voie,adresse_code_voie,code_postal,code_commune,nom_commune,code_departement,ancien_code_commune,ancien_nom_commune,id_parcelle,ancien_id_parcelle,numero_volume,lot1_numero,lot1_surface_carrez,lot2_numero,lot2_surface_carrez,lot3_numero,lot3_surface_carrez,lot4_numero,lot4_surface_carrez,lot5_numero,lot5_surface_carrez,nombre_lots,code_type_local,type_local,surface_reelle_bati,nombre_pieces_principales,code_nature_culture,nature_culture,code_nature_culture_speciale,nature_culture_speciale,surface_terrain,longitude,latitude
2020-416015,2020-02-05,000001,Vente,60000,5004,A,AU NINOT,B060,32110,32458,Urgosse,32,,,324580000A1697,,,,,,,,,,,,,0,1,Maison,80,4,AG,terrains d'agrément,,,2101,-0.021051,43.745739
2020-416015,2020-02-05,000001,Vente,60000,5004,A,AU NINOT,B060,32110,32458,Urgosse,32,,,324580000A1697,,,,,,,,,,,,,0,1,Maison,80,4,S,sols,,,832,-0.021051,43.745739
2020-416224,2020-02-27,000001,Vente,45000,5151,,A BLANCHE,B008,32110,32458,Urgosse,32,,,324580000A1719,,,,,,,,,,,,,0,1,Maison,61,2,S,sols,,,341,-0.030282,43.729811
2020-416224,2020-02-27,000001,Vente,45000,,,A BLANCHE,B008,32110,32458,Urgosse,32,,,324580000A1721,,,,,,,,,,,,,0,,,,,J,jardins,,,803,-0.030666,43.730121
2020-416224,2020-02-27,000001,Vente,45000,,,A BLANCHE,B008,32110,32458,Urgosse,32,,,324580000A1722,,,,,,,,,,,,,0,,,,,T,terres,,,1341,-0.030532,43.729816
2020-416224,2020-02-27,000001,Vente,45000,,,A BLANCHE,B008,32110,32458,Urgosse,32,,,324580000A1724,,,,,,,,,,,,,0,,,,,T,terres,,,372,-0.030886,43.730119
2020-416534,2020-03-06,000001,Vente,8200,,,LES PRES DU MOULIN,B077,32110,32458,Urgosse,32,,,324580000A0088,,,,,,,,,,,,,0,,,,,BP,peupleraies,,,16391,-0.01277,43.742441
2020-417249,2020-05-22,000001,Vente,95000,5033,,LA PIERRE DU HAOU,B069,32110,32458,Urgosse,32,,,324580000A1803,,,,,,,,,,,,,0,1,Maison,135,7,T,terres,,,888,-0.028013,43.731419
2020-417249,2020-05-22,000001,Vente,95000,5033,,LA PIERRE DU HAOU,B069,32110,32458,Urgosse,32,,,324580000A1803,,,,,,,,,,,,,0,1,Maison,135,7,S,sols,,,1000,-0.028013,43.731419
2020-417249,2020-05-22,000001,Vente,95000,,,LA PIERRE DU HAOU,B069,32110,32458,Urgosse,32,,,324580000A1805,,,,,,,,,,,,,0,,,,,S,sols,,,706,-0.027992,43.731594
2020-417736,2020-06-25,000001,Vente,1100,,,A MARION,B057,32110,32458,Urgosse,32,,,324580000A0787,,,,,,,,,,,,,0,,,,,BS,taillis sous futaie,,,6960,-0.028254,43.729434
2020-418197,2020-06-12,000001,Vente,167000,,,A GIRAM,B040,32110,32458,Urgosse,32,,,324580000A1459,,,,,,,,,,,,,0,,,,,T,terres,,,318,-0.031357,43.728063
2020-418197,2020-06-12,000001,Vente,167000,5110,,A GIRAM,B040,32110,32458,Urgosse,32,,,324580000A1461,,,,,,,,,,,,,0,1,Maison,120,5,AG,terrains d'agrément,,,3205,-0.030598,43.72815
2020-418197,2020-06-12,000001,Vente,167000,5110,,A GIRAM,B040,32110,32458,Urgosse,32,,,324580000A1461,,,,,,,,,,,,,0,1,Maison,120,5,S,sols,,,2615,-0.030598,43.72815
2020-418542,2020-09-25,000001,Vente,120000,5141,,AU CAPUCIN,B018,32110,32458,Urgosse,32,,,324580000A0843,,,,,,,,,,,,,0,1,Maison,120,4,S,sols,,,1000,-0.03681,43.738222
2020-418542,2020-09-25,000001,Vente,120000,5141,,AU CAPUCIN,B018,32110,32458,Urgosse,32,,,324580000A0843,,,,,,,,,,,,,0,1,Maison,120,4,T,terres,,,3432,-0.03681,43.738222
2020-419574,2020-11-27,000001,Vente,86000,,,LA PIERRE DU HAOU,B069,32110,32458,Urgosse,32,,,324580000A1071,,,,,,,,,,,,,0,,,,,J,jardins,,,616,-0.027092,43.731871
2020-419574,2020-11-27,000001,Vente,86000,,,LA PIERRE DU HAOU,B069,32110,32458,Urgosse,32,,,324580000A1277,,,,,,,,,,,,,0,,,,,S,sols,,,13,-0.027536,43.731679
2020-419574,2020-11-27,000001,Vente,86000,5031,,DUTILLAU,B028,32110,32458,Urgosse,32,,,324580000A1279,,,,,,,,,,,,,0,1,Maison,97,4,S,sols,,,823,-0.027469,43.731698
2020-419777,2020-12-10,000001,Vente,88500,,,LE PRESBYTERE,B078,32110,32458,Urgosse,32,,,324580000A1031,,,,,,,,,,,,,0,,,,,T,terres,,,2970,-0.025199,43.735181
2020-419777,2020-12-10,000001,Vente,88500,,,LE PRESBYTERE,B078,32110,32458,Urgosse,32,,,324580000A1034,,,,,,,,,,,,,0,,,,,J,jardins,,,393,-0.024513,43.734735
2020-419777,2020-12-10,000001,Vente,88500,5098,,LE PRESBYTERE,B078,32110,32458,Urgosse,32,,,324580000A1035,,,,,,,,,,,,,0,1,Maison,145,5,S,sols,,,2120,-0.025129,43.734812
2020-419777,2020-12-10,000001,Vente,88500,5098,,LE PRESBYTERE,B078,32110,32458,Urgosse,32,,,324580000A1035,,,,,,,,,,,,,0,1,Maison,145,5,T,terres,,,2160,-0.025129,43.734812
2020-419777,2020-12-10,000001,Vente,88500,,,LE NOBLE,B061,32110,32458,Urgosse,32,,,324580000A1220,,,,,,,,,,,,,0,,,,,S,sols,,,115,-0.024476,43.735016
