id_mutation,date_mutation,numero_disposition,nature_mutation,valeur_fonciere,adresse_numero,adresse_suffixe,adresse_nom_voie,adresse_code_voie,code_postal,code_commune,nom_commune,code_departement,ancien_code_commune,ancien_nom_commune,id_parcelle,ancien_id_parcelle,numero_volume,lot1_numero,lot1_surface_carrez,lot2_numero,lot2_surface_carrez,lot3_numero,lot3_surface_carrez,lot4_numero,lot4_surface_carrez,lot5_numero,lot5_surface_carrez,nombre_lots,code_type_local,type_local,surface_reelle_bati,nombre_pieces_principales,code_nature_culture,nature_culture,code_nature_culture_speciale,nature_culture_speciale,surface_terrain,longitude,latitude
2020-485205,2020-01-17,000001,Vente,90000,,,LE VILLAGE,B089,34320,34181,Neffiès,34,,,341810000C0189,,,,,,,,,,,,,0,,,,,S,sols,,,32,3.332239,43.534754
2020-485205,2020-01-17,000001,Vente,90000,3,,RUE MOLINIER,0058,34320,34181,Neffiès,34,,,341810000C0192,,,,,,,,,,,,,0,1,Maison,54,3,S,sols,,,35,3.332184,43.534743
2020-485672,2020-02-20,000001,Vente,56050,5,,PLAN PRADINES,0067,34320,34181,Neffiès,34,,,341810000C0281,,,,,,,,,,,,,0,1,Maison,35,2,S,sols,,,47,3.330604,43.533785
2020-486125,2020-03-03,000001,Vente,1,,,LA GRANGASSE,B054,34320,34181,Neffiès,34,,,341810000E0768,,,,,,,,,,,,,0,,,,,S,sols,,,5,3.327378,43.532852
2020-486156,2020-03-03,000001,Vente,1,,,LA GRANGASSE,B054,34320,34181,Neffiès,34,,,341810000E0764,,,,,,,,,,,,,0,,,,,S,sols,,,5,3.327296,43.532829
2020-486156,2020-03-03,000001,Vente,1,,,LA GRANGASSE,B054,34320,34181,Neffiès,34,,,341810000E0766,,,,,,,,,,,,,0,,,,,VI,vignes,,,23,3.327115,43.532775
2020-486663,2020-03-24,000001,Vente,119000,4,,RUE DES ECOLES,0102,34320,34181,Neffiès,34,,,341810000C0755,,,,,,,,,,,,,0,1,Maison,84,4,S,sols,,,544,3.334882,43.534207
2020-486784,2020-03-19,000001,Vente,90000,32,,AV DE LA GARE,0035,34320,34181,Neffiès,34,,,341810000E0876,,,,,,,,,,,,,0,,,,,AG,terrains d'agrément,,,1067,3.328077,43.529596
2020-486827,2020-04-03,000001,Vente,1500,,,LE VILLAGE,B089,34320,34181,Neffiès,34,,,341810000C0022,,,,,,,,,,,,,0,,,,,J,jardins,,,260,3.329999,43.531812
2020-486827,2020-04-03,000001,Vente,1500,,,LE VILLAGE,B089,34320,34181,Neffiès,34,,,341810000C0023,,,,,,,,,,,,,0,,,,,L,landes,,,145,3.329951,43.531745
2020-489251,2020-06-10,000001,Vente,230000,,,LE VILLAGE,B089,34320,34181,Neffiès,34,,,341810000C0440,,,,,,,,,,,,,0,,,,,J,jardins,,,87,3.331965,43.533174
2020-489251,2020-06-10,000001,Vente,230000,1,,CHE DE FONT BASSE,0031,34320,34181,Neffiès,34,,,341810000C0442,,,,,,,,,,,,,0,1,Maison,60,2,S,sols,,,80,3.331732,43.533363
2020-489408,2020-06-19,000001,Vente,215670,25,,RUE DES PINS,0095,34320,34181,Neffiès,34,,,341810000C0659,,,,,,,,,,,,,0,1,Maison,100,5,S,sols,,,572,3.333238,43.531478
2020-489495,2020-07-17,000001,Vente,4000,,,PIOCH DE MOUSSALOU,B070,34320,34181,Neffiès,34,,,341810000E0791,,,,,,,,,,,,,0,,,,,T,terres,,,772,3.328188,43.527306
2020-490161,2020-07-30,000002,Vente,387770,3,,CHE DE VAILHAN,0086,34320,34181,Neffiès,34,,,341810000E0438,,,,,,,,,,,,,0,,,,,S,sols,,,430,3.328424,43.534918
2020-490161,2020-07-30,000002,Vente,387770,3,,CHE DE VAILHAN,0086,34320,34181,Neffiès,34,,,341810000E0778,,,,,,,,,,,,,0,,,,,AG,terrains d'agrément,,,1168,3.328498,43.534727
2020-490219,2020-07-20,000001,Vente,93110,10,,RUE ENJALBERT,0028,34320,34181,Neffiès,34,,,341810000C0296,,,,,,,,,,,,,0,1,Maison,56,3,S,sols,,,40,3.330897,43.533943
2020-491052,2020-08-26,000001,Vente,430000,22,,CHE DE VAILHAN,0086,34320,34181,Neffiès,34,,,341810000A0696,,,,,,,,,,,,,0,3,Dépendance,,0,T,terres,,,2280,3.328286,43.536425
2020-491052,2020-08-26,000001,Vente,430000,22,,CHE DE VAILHAN,0086,34320,34181,Neffiès,34,,,341810000A0696,,,,,,,,,,,,,0,3,Dépendance,,0,AG,terrains d'agrément,,,1000,3.328286,43.536425
2020-491052,2020-08-26,000001,Vente,430000,22,,CHE DE VAILHAN,0086,34320,34181,Neffiès,34,,,341810000A0696,,,,,,,,,,,,,0,1,Maison,156,6,S,sols,,,1000,3.328286,43.536425
2020-491052,2020-08-26,000001,Vente,430000,22,,CHE DE VAILHAN,0086,34320,34181,Neffiès,34,,,341810000A0696,,,,,,,,,,,,,0,3,Dépendance,,0,S,sols,,,1000,3.328286,43.536425
2020-491052,2020-08-26,000001,Vente,430000,22,,CHE DE VAILHAN,0086,34320,34181,Neffiès,34,,,341810000A0696,,,,,,,,,,,,,0,1,Maison,156,6,AG,terrains d'agrément,,,1000,3.328286,43.536425
2020-491052,2020-08-26,000001,Vente,430000,22,,CHE DE VAILHAN,0086,34320,34181,Neffiès,34,,,341810000A0696,,,,,,,,,,,,,0,3,Dépendance,,0,AG,terrains d'agrément,,,1000,3.328286,43.536425
2020-491052,2020-08-26,000001,Vente,430000,22,,CHE DE VAILHAN,0086,34320,34181,Neffiès,34,,,341810000A0696,,,,,,,,,,,,,0,3,Dépendance,,0,T,terres,,,2280,3.328286,43.536425
2020-491052,2020-08-26,000001,Vente,430000,22,,CHE DE VAILHAN,0086,34320,34181,Neffiès,34,,,341810000A0696,,,,,,,,,,,,,0,1,Maison,156,6,T,terres,,,2280,3.328286,43.536425
2020-491052,2020-08-26,000001,Vente,430000,22,,CHE DE VAILHAN,0086,34320,34181,Neffiès,34,,,341810000A0696,,,,,,,,,,,,,0,3,Dépendance,,0,S,sols,,,1000,3.328286,43.536425
2020-491064,2020-08-28,000001,Vente,102000,36,,RUE DES AIRES HAUTES,0002,34320,34181,Neffiès,34,,,341810000C0130,,,,,,,,,,,,,0,1,Maison,75,3,S,sols,,,35,3.332493,43.534904
2020-491128,2020-09-01,000001,Vente,223000,18,,AV DE CAUX,0015,34320,34181,Neffiès,34,,,341810000D0516,,,,,,,,,,,,,0,3,Dépendance,,0,S,sols,,,995,3.33317,43.529194
2020-491128,2020-09-01,000001,Vente,223000,18,,AV DE CAUX,0015,34320,34181,Neffiès,34,,,341810000D0516,,,,,,,,,,,,,0,1,Maison,90,6,S,sols,,,995,3.33317,43.529194
2020-491209,2020-08-20,000001,Vente,127710,6,,RUE DE L'ANCIEN BASSIN,0006,34320,34181,Neffiès,34,,,341810000C0127,,,1,,2,,3,,4,,5,,6,1,Maison,56,4,,,,,,3.332225,43.534851
2020-491427,2020-09-15,000001,Vente,1000,,,PECH ROME,B062,34320,34181,Neffiès,34,,,341810000B0562,,,,,,,,,,,,,0,,,,,VI,vignes,,,1930,3.337613,43.534438
2020-491605,2020-08-27,000001,Vente,193000,12,,AV DE CAUX,0015,34320,34181,Neffiès,34,,,341810000D0513,,,,,,,,,,,,,0,1,Maison,82,4,AG,terrains d'agrément,,,548,3.332547,43.529432
2020-491605,2020-08-27,000001,Vente,193000,12,,AV DE CAUX,0015,34320,34181,Neffiès,34,,,341810000D0513,,,,,,,,,,,,,0,1,Maison,82,4,S,sols,,,500,3.332547,43.529432
2020-491917,2020-06-29,000002,Vente,85000,5474,,CHE DES TUILERIES,0084,34320,34181,Neffiès,34,,,341810000D0703,,,,,,,,,,,,,0,1,Maison,115,4,,,,,,3.336808,43.532288
2020-492068,2020-09-23,000001,Vente,70000,,,PIOCH DE MOUSSALOU,B070,34320,34181,Neffiès,34,,,341810000E0660,,,,,,,,,,,,,0,,,,,T,terres,,,1060,3.32708,43.528388
2020-492103,2020-09-29,000001,Vente,375750,3,,CHEM DE LA SOURCE,0076,34320,34181,Neffiès,34,,,341810000A0708,,,,,,,,,,,,,0,3,Dépendance,,0,AG,terrains d'agrément,,,1057,3.332384,43.538467
2020-492103,2020-09-29,000001,Vente,375750,3,,CHEM DE LA SOURCE,0076,34320,34181,Neffiès,34,,,341810000A0708,,,,,,,,,,,,,0,3,Dépendance,,0,S,sols,,,800,3.332384,43.538467
2020-492103,2020-09-29,000001,Vente,375750,3,,CHEM DE LA SOURCE,0076,34320,34181,Neffiès,34,,,341810000A0708,,,,,,,,,,,,,0,3,Dépendance,,0,S,sols,,,800,3.332384,43.538467
2020-492103,2020-09-29,000001,Vente,375750,3,,CHEM DE LA SOURCE,0076,34320,34181,Neffiès,34,,,341810000A0708,,,,,,,,,,,,,0,1,Maison,130,6,S,sols,,,800,3.332384,43.538467
2020-492103,2020-09-29,000001,Vente,375750,3,,CHEM DE LA SOURCE,0076,34320,34181,Neffiès,34,,,341810000A0708,,,,,,,,,,,,,0,1,Maison,130,6,AG,terrains d'agrément,,,1057,3.332384,43.538467
2020-492103,2020-09-29,000001,Vente,375750,3,,CHEM DE LA SOURCE,0076,34320,34181,Neffiès,34,,,341810000A0708,,,,,,,,,,,,,0,3,Dépendance,,0,AG,terrains d'agrément,,,1057,3.332384,43.538467
2020-492103,2020-09-29,000001,Vente,375750,,,CHEM DE LA SOURCE,0076,34320,34181,Neffiès,34,,,341810000A0709,,,,,,,,,,,,,0,,,,,S,sols,,,185,3.3329,43.538425
2020-492195,2020-09-30,000001,Vente,255650,16,,AV DE CAUX,0015,34320,34181,Neffiès,34,,,341810000D0515,,,,,,,,,,,,,0,1,Maison,116,4,S,sols,,,500,3.332892,43.529129
2020-492195,2020-09-30,000001,Vente,255650,16,,AV DE CAUX,0015,34320,34181,Neffiès,34,,,341810000D0515,,,,,,,,,,,,,0,3,Dépendance,,0,S,sols,,,500,3.332892,43.529129
2020-492195,2020-09-30,000001,Vente,255650,16,,AV DE CAUX,0015,34320,34181,Neffiès,34,,,341810000D0515,,,,,,,,,,,,,0,1,Maison,116,4,AG,terrains d'agrément,,,809,3.332892,43.529129
2020-492195,2020-09-30,000001,Vente,255650,16,,AV DE CAUX,0015,34320,34181,Neffiès,34,,,341810000D0515,,,,,,,,,,,,,0,3,Dépendance,,0,AG,terrains d'agrément,,,809,3.332892,43.529129
2020-492350,2020-10-07,000001,Vente,25000,,,LA VIGNASSE,B087,34320,34181,Neffiès,34,,,341810000D0188,,,,,,,,,,,,,0,,,,,VI,vignes,,,1775,3.340609,43.532198
2020-492350,2020-10-07,000001,Vente,25000,,,LA VIGNASSE,B087,34320,34181,Neffiès,34,,,341810000D0188,,,,,,,,,,,,,0,,,,,VI,vignes,,,1775,3.340609,43.532198
2020-492350,2020-10-07,000001,Vente,25000,,,LA VIGNASSE,B087,34320,34181,Neffiès,34,,,341810000D0189,,,,,,,,,,,,,0,,,,,T,terres,,,3000,3.340276,43.53148
2020-492350,2020-10-07,000001,Vente,25000,,,LA VIGNASSE,B087,34320,34181,Neffiès,34,,,341810000D0189,,,,,,,,,,,,,0,,,,,VI,vignes,,,4050,3.340276,43.53148
2020-492350,2020-10-07,000001,Vente,25000,,,LA VIGNASSE,B087,34320,34181,Neffiès,34,,,341810000D0190,,,,,,,,,,,,,0,,,,,L,landes,,,900,3.339777,43.531636
2020-492350,2020-10-07,000001,Vente,25000,,,LA VIGNASSE,B087,34320,34181,Neffiès,34,,,341810000D0194,,,,,,,,,,,,,0,,,,,VI,vignes,,,8950,3.340878,43.531192
2020-492350,2020-10-07,000001,Vente,25000,,,LA PRADETTE,B074,34320,34181,Neffiès,34,,,341810000D0291,,,,,,,,,,,,,0,,,,,VI,vignes,,,1950,3.341625,43.529131
2020-492350,2020-10-07,000001,Vente,25000,,,LA PRADETTE,B074,34320,34181,Neffiès,34,,,341810000D0292,,,,,,,,,,,,,0,,,,,VI,vignes,,,950,3.341563,43.529456
2020-492350,2020-10-07,000001,Vente,25000,,,LA PRADETTE,B074,34320,34181,Neffiès,34,,,341810000D0295,,,,,,,,,,,,,0,,,,,T,terres,,,645,3.341183,43.529192
2020-492403,2020-10-08,000001,Vente,22500,,,LES LOUVIERES HAUTES,B058,34320,34181,Neffiès,34,,,341810000A0248,,,,,,,,,,,,,0,,,,,T,terres,,,3125,3.326798,43.544247
2020-492403,2020-10-08,000001,Vente,22500,,,LES LOUVIERES HAUTES,B058,34320,34181,Neffiès,34,,,341810000A0250,,,,,,,,,,,,,0,,,,,T,terres,,,1940,3.326008,43.544274
2020-492403,2020-10-08,000001,Vente,22500,,,LES LOUVIERES HAUTES,B058,34320,34181,Neffiès,34,,,341810000A0251,,,,,,,,,,,,,0,,,,,T,terres,,,1320,3.325916,43.544413
2020-492403,2020-10-08,000001,Vente,22500,,,LES LOUVIERES HAUTES,B058,34320,34181,Neffiès,34,,,341810000A0252,,,,,,,,,,,,,0,,,,,T,terres,,,655,3.326479,43.544494
2020-492946,2020-10-23,000001,Vente,195250,,,LE VILLAGE,B089,34320,34181,Neffiès,34,,,341810000C0592,,,,,,,,,,,,,0,,,,,T,terres,,,448,3.335465,43.533173
2020-492946,2020-10-23,000001,Vente,195250,6,,IMP DES SALAMANDRES,0098,34320,34181,Neffiès,34,,,341810000C0629,,,,,,,,,,,,,0,1,Maison,89,4,S,sols,,,436,3.334928,43.53312
2020-492946,2020-10-23,000001,Vente,195250,,,LE VILLAGE,B089,34320,34181,Neffiès,34,,,341810000C0632,,,,,,,,,,,,,0,,,,,AB,terrains a bâtir,RUE,Rue,217,3.335107,43.532981
2020-492980,2020-10-27,000001,Vente,1000,,,PIOCH CLERGUE,B068,34320,34181,Neffiès,34,,,341810000A0093,,,,,,,,,,,,,0,,,,,T,terres,,,1435,3.328022,43.538803
2020-492980,2020-10-27,000001,Vente,1000,,,PIOCH CLERGUE,B068,34320,34181,Neffiès,34,,,341810000A0111,,,,,,,,,,,,,0,,,,,T,terres,,,1565,3.327858,43.539297
2020-493154,2020-10-15,000001,Vente,324200,6,,PIOCH DE MOUSSALOU,B070,34320,34181,Neffiès,34,,,341810000E0718,,,,,,,,,,,,,0,1,Maison,168,5,AG,terrains d'agrément,,,500,3.328075,43.531702
2020-493154,2020-10-15,000001,Vente,324200,6,,PIOCH DE MOUSSALOU,B070,34320,34181,Neffiès,34,,,341810000E0718,,,,,,,,,,,,,0,3,Dépendance,,0,S,sols,,,500,3.328075,43.531702
2020-493154,2020-10-15,000001,Vente,324200,6,,PIOCH DE MOUSSALOU,B070,34320,34181,Neffiès,34,,,341810000E0718,,,,,,,,,,,,,0,1,Maison,168,5,S,sols,,,500,3.328075,43.531702
2020-493154,2020-10-15,000001,Vente,324200,6,,PIOCH DE MOUSSALOU,B070,34320,34181,Neffiès,34,,,341810000E0718,,,,,,,,,,,,,0,3,Dépendance,,0,AG,terrains d'agrément,,,500,3.328075,43.531702
2020-494018,2020-11-19,000001,Vente,105100,29,,AV DE LA GARE,0035,34320,34181,Neffiès,34,,,341810000D0035,,,,,,,,,,,,,0,1,Maison,80,3,S,sols,,,270,3.329599,43.530807
2020-494278,2020-11-23,000001,Vente,100000,,,LE VILLAGE,B089,34320,34181,Neffiès,34,,,341810000C0589,,,,,,,,,,,,,0,,,,,T,terres,,,1430,3.335642,43.532913
2020-494278,2020-11-23,000001,Vente,100000,,,LE VILLAGE,B089,34320,34181,Neffiès,34,,,341810000C0592,,,,,,,,,,,,,0,,,,,T,terres,,,448,3.335465,43.533173
2020-494344,2020-12-04,000001,Vente,95000,10,,PL LIEUTENANT PAUL GAUFFRE,0050,34320,34181,Neffiès,34,,,341810000C0249,,,,,,,,,,,,,0,4,Local industriel. commercial ou assimilé,72,0,S,sols,,,127,3.331374,43.534432
2020-494344,2020-12-04,000001,Vente,95000,10,,PL LIEUTENANT PAUL GAUFFRE,0050,34320,34181,Neffiès,34,,,341810000C0249,,,,,,,,,,,,,0,1,Maison,50,2,S,sols,,,127,3.331374,43.534432
2020-494344,2020-12-04,000001,Vente,95000,10,,PL LIEUTENANT PAUL GAUFFRE,0050,34320,34181,Neffiès,34,,,341810000C0249,,,,,,,,,,,,,0,3,Dépendance,,0,S,sols,,,127,3.331374,43.534432
2020-494505,2020-12-09,000001,Vente,2500,,,CANTE-MERLES,B011,34320,34181,Neffiès,34,,,341810000E0334,,,,,,,,,,,,,0,,,,,J,jardins,,,153,3.322447,43.537875
2020-494505,2020-12-09,000001,Vente,2500,,,CANTE-MERLES,B011,34320,34181,Neffiès,34,,,341810000E0335,,,,,,,,,,,,,0,,,,,L,landes,,,65,3.322369,43.53794
2020-494505,2020-12-09,000001,Vente,2500,,,CANTE-MERLES,B011,34320,34181,Neffiès,34,,,341810000E0336,,,,,,,,,,,,,0,,,,,L,landes,,,525,3.322455,43.538004
2020-494505,2020-12-09,000001,Vente,2500,,,CANTE-MERLES,B011,34320,34181,Neffiès,34,,,341810000E0337,,,,,,,,,,,,,0,,,,,J,jardins,,,155,3.322024,43.538288
2020-494505,2020-12-09,000001,Vente,2500,,,CANTE-MERLES,B011,34320,34181,Neffiès,34,,,341810000E0338,,,,,,,,,,,,,0,,,,,T,terres,,,430,3.321772,43.538515
2020-495240,2020-12-16,000001,Vente,225000,13,,ALL DES TAMARIS,0082,34320,34181,Neffiès,34,,,341810000C0666,,,,,,,,,,,,,0,1,Maison,90,4,S,sols,,,450,3.333293,43.531859
2020-495398,2020-12-08,000001,Vente,80000,4,,RUE DE LA GUILLAUMELLE,0038,34320,34181,Neffiès,34,,,341810000C0267,,,,,,,,,,,,,0,1,Maison,72,5,S,sols,,,63,3.330731,43.533989
2020-495859,2020-12-22,000001,Vente,314152,5,,RUE DES PINS,0095,34320,34181,Neffiès,34,,,341810000C0639,,,,,,,,,,,,,0,1,Maison,125,5,S,sols,,,600,3.331158,43.531487
