id_mutation,date_mutation,numero_disposition,nature_mutation,valeur_fonciere,adresse_numero,adresse_suffixe,adresse_nom_voie,adresse_code_voie,code_postal,code_commune,nom_commune,code_departement,ancien_code_commune,ancien_nom_commune,id_parcelle,ancien_id_parcelle,numero_volume,lot1_numero,lot1_surface_carrez,lot2_numero,lot2_surface_carrez,lot3_numero,lot3_surface_carrez,lot4_numero,lot4_surface_carrez,lot5_numero,lot5_surface_carrez,nombre_lots,code_type_local,type_local,surface_reelle_bati,nombre_pieces_principales,code_nature_culture,nature_culture,code_nature_culture_speciale,nature_culture_speciale,surface_terrain,longitude,latitude
2020-474835,2020-01-30,000001,Vente,431500,235,,CHE DE SAINT SERIES,0050,34400,34340,Villetelle,34,,,343400000B0374,,,,,,,,,,,,,0,3,Dépendance,,0,S,sols,,,500,4.135516,43.734089
2020-474835,2020-01-30,000001,Vente,431500,235,,CHE DE SAINT SERIES,0050,34400,34340,Villetelle,34,,,343400000B0374,,,,,,,,,,,,,0,1,Maison,129,5,S,sols,,,500,4.135516,43.734089
2020-474835,2020-01-30,000001,Vente,431500,235,,CHE DE SAINT SERIES,0050,34400,34340,Villetelle,34,,,343400000B0374,,,,,,,,,,,,,0,1,Maison,129,5,AG,terrains d'agrément,,,953,4.135516,43.734089
2020-474835,2020-01-30,000001,Vente,431500,235,,CHE DE SAINT SERIES,0050,34400,34340,Villetelle,34,,,343400000B0374,,,,,,,,,,,,,0,3,Dépendance,,0,AG,terrains d'agrément,,,953,4.135516,43.734089
2020-475056,2020-02-03,000001,Vente,75000,,,LE GRES,B013,34400,34340,Villetelle,34,,,343400000A2549,,,,,,,,,,,,,0,,,,,AB,terrains a bâtir,,,152,4.139479,43.730156
2020-475058,2020-01-31,000001,Vente,135000,,,LE GRES,B013,34400,34340,Villetelle,34,,,343400000A2518,,,,,,,,,,,,,0,,,,,AB,terrains a bâtir,,,69,4.139276,43.729881
2020-475058,2020-01-31,000001,Vente,135000,,,LE GRES,B013,34400,34340,Villetelle,34,,,343400000A2524,,,,,,,,,,,,,0,,,,,AB,terrains a bâtir,,,109,4.139372,43.729902
2020-475058,2020-01-31,000001,Vente,135000,,,LE GRES,B013,34400,34340,Villetelle,34,,,343400000A2548,,,,,,,,,,,,,0,,,,,AB,terrains a bâtir,,,147,4.139282,43.729996
2020-475931,2020-03-06,000001,Vente,172900,,,LE GRES,B013,34400,34340,Villetelle,34,,,343400000A2536,,,,,,,,,,,,,0,,,,,AB,terrains a bâtir,,,450,4.139689,43.730963
2020-476012,2020-03-02,000001,Vente,145000,684,,CHEMIN DE MONTPELLIER,B003,34400,34340,Villetelle,34,,,343400000A2482,,,,,,,,,,,,,0,,,,,AB,terrains a bâtir,,,300,4.135205,43.728188
2020-476362,2020-03-11,000001,Vente,12180,,,CHEMIN DE LUNEL,B001,34400,34340,Villetelle,34,,,343400000A2287,,,,,,,,,,,,,0,,,,,S,sols,,,68,4.135606,43.716473
2020-476362,2020-03-11,000001,Vente,12180,,,LES COMBES,B005,34400,34340,Villetelle,34,,,343400000A2293,,,,,,,,,,,,,0,,,,,S,sols,,,121,4.144545,43.720442
2020-476362,2020-03-11,000001,Vente,12180,,,LES COMBES,B005,34400,34340,Villetelle,34,,,343400000A2294,,,,,,,,,,,,,0,,,,,S,sols,,,859,4.144988,43.720546
2020-476362,2020-03-11,000001,Vente,12180,,,CHEMIN DE LUNEL,B001,34400,34340,Villetelle,34,,,343400000A2298,,,,,,,,,,,,,0,,,,,S,sols,,,1415,4.136582,43.715217
2020-476362,2020-03-11,000001,Vente,12180,,,CHEMIN DE LUNEL,B001,34400,34340,Villetelle,34,,,343400000A2301,,,,,,,,,,,,,0,,,,,S,sols,,,570,4.139407,43.717382
2020-476362,2020-03-11,000001,Vente,12180,,,CHEMIN DE LUNEL,B001,34400,34340,Villetelle,34,,,343400000A2302,,,,,,,,,,,,,0,,,,,S,sols,,,640,4.138304,43.716232
2020-476362,2020-03-11,000001,Vente,12180,,,CHEMIN DE LUNEL,B001,34400,34340,Villetelle,34,,,343400000A2303,,,,,,,,,,,,,0,,,,,S,sols,,,482,4.140223,43.717893
2020-476362,2020-03-11,000001,Vente,12180,,,CHEMIN DE LUNEL,B001,34400,34340,Villetelle,34,,,343400000A2305,,,,,,,,,,,,,0,,,,,S,sols,,,1062,4.138595,43.716729
2020-476363,2020-03-26,000001,Vente,125000,,,LA ROQUE,B023,34400,34340,Villetelle,34,,,343400000B0594,,,,,,,,,,,,,0,,,,,S,sols,,,441,4.131653,43.73595
2020-476649,2020-04-15,000001,Vente,143000,684,,CHEMIN DE MONTPELLIER,B003,34400,34340,Villetelle,34,,,343400000A2480,,,,,,,,,,,,,0,,,,,AB,terrains a bâtir,,,300,4.135516,43.727999
2020-476927,2020-05-15,000001,Vente,129500,,,LE GRES,B013,34400,34340,Villetelle,34,,,343400000A2543,,,,,,,,,,,,,0,,,,,AB,terrains a bâtir,,,300,4.139987,43.73053
2020-476928,2020-05-11,000001,Vente,300000,,,DEVANT LEQUIS,B006,34400,34340,Villetelle,34,,,343400000A0079,,,,,,,,,,,,,0,,,,,L,landes,,,600,4.143719,43.725406
2020-476928,2020-05-11,000001,Vente,300000,,,DEVANT LEQUIS,B006,34400,34340,Villetelle,34,,,343400000A0080,,,,,,,,,,,,,0,,,,,T,terres,,,1615,4.14401,43.725354
2020-476928,2020-05-11,000001,Vente,300000,,,DEVANT LEQUIS,B006,34400,34340,Villetelle,34,,,343400000A0081,,,,,,,,,,,,,0,,,,,T,terres,,,3265,4.14434,43.725034
2020-476928,2020-05-11,000001,Vente,300000,5082,,DEVANT LEQUIS,B006,34400,34340,Villetelle,34,,,343400000A0082,,,,,,,,,,,,,0,3,Dépendance,,0,S,sols,,,15,4.144582,43.724541
2020-476928,2020-05-11,000001,Vente,300000,5082,,DEVANT LEQUIS,B006,34400,34340,Villetelle,34,,,343400000A0082,,,,,,,,,,,,,0,3,Dépendance,,0,T,terres,,,5175,4.144582,43.724541
2020-476928,2020-05-11,000001,Vente,300000,,,DEVANT LEQUIS,B006,34400,34340,Villetelle,34,,,343400000A0085,,,,,,,,,,,,,0,,,,,T,terres,,,3610,4.144841,43.723713
2020-476928,2020-05-11,000001,Vente,300000,,,DEVANT LEQUIS,B006,34400,34340,Villetelle,34,,,343400000A0086,,,,,,,,,,,,,0,,,,,T,terres,,,3420,4.144822,43.724005
2020-476928,2020-05-11,000001,Vente,300000,1037,,RTE DE LUNEL,0027,34400,34340,Villetelle,34,,,343400000A1813,,,,,,,,,,,,,0,1,Maison,60,3,T,terres,,,15657,4.143342,43.72305
2020-477312,2020-06-03,000001,Vente,174900,,,LE GRES,B013,34400,34340,Villetelle,34,,,343400000A2527,,,,,,,,,,,,,0,,,,,AB,terrains a bâtir,,,455,4.138648,43.729975
2020-477416,2020-05-14,000001,Vente,449350,437,,CHE DES COMBES NOIRES,0013,34400,34340,Villetelle,34,,,343400000A2032,,,,,,,,,,,,,0,1,Maison,137,6,S,sols,,,1002,4.136533,43.722162
2020-477691,2020-05-20,000002,Vente,22000,,,CHEMIN DE LUNEL,B001,34400,34340,Villetelle,34,,,343400000A2512,,,,,,,,,,,,,0,,,,,L,landes,,,1347,4.141452,43.720015
2020-477744,2020-06-05,000001,Vente,174500,,,LE GRES,B013,34400,34340,Villetelle,34,,,343400000A2531,,,,,,,,,,,,,0,,,,,AB,terrains a bâtir,,,500,4.138826,43.730453
2020-477747,2020-06-08,000001,Vente,75000,,,LE GRES,B013,34400,34340,Villetelle,34,,,343400000A2551,,,,,,,,,,,,,0,,,,,AB,terrains a bâtir,,,152,4.139517,43.730291
2020-477750,2020-06-12,000001,Vente,135500,,,LE GRES,B013,34400,34340,Villetelle,34,,,343400000A2517,,,,,,,,,,,,,0,,,,,AB,terrains a bâtir,,,177,4.139166,43.729818
2020-477750,2020-06-12,000001,Vente,135500,,,LE GRES,B013,34400,34340,Villetelle,34,,,343400000A2547,,,,,,,,,,,,,0,,,,,AB,terrains a bâtir,,,148,4.139084,43.729904
2020-477802,2020-05-29,000001,Vente,477125,,,CHEMIN DE MONTPELLIER,B003,34400,34340,Villetelle,34,,,343400000A2348,,,,,,,,,,,,,0,,,,,AB,terrains a bâtir,,,538,4.131572,43.724808
2020-477802,2020-05-29,000001,Vente,477125,1150,,CHEMIN DE MONTPELLIER,B003,34400,34340,Villetelle,34,,,343400000A2382,,,,,,,,,,,,,0,,,,,AB,terrains a bâtir,,,27,4.131495,43.724723
2020-477946,2020-06-24,000001,Vente,158500,,,LE GRES,B013,34400,34340,Villetelle,34,,,343400000A2540,,,,,,,,,,,,,0,,,,,AB,terrains a bâtir,,,400,4.140128,43.731085
2020-478156,2020-06-30,000001,Vente,172500,,,LE GRES,B013,34400,34340,Villetelle,34,,,343400000A2533,,,,,,,,,,,,,0,,,,,AB,terrains a bâtir,,,450,4.1391,43.730701
2020-478337,2020-06-15,000001,Vente,159900,,,LE GRES,B013,34400,34340,Villetelle,34,,,343400000A2522,,,,,,,,,,,,,0,,,,,AB,terrains a bâtir,,,400,4.13982,43.729893
2020-478359,2020-07-07,000001,Vente,1350,,,LE GRES,B013,34400,34340,Villetelle,34,,,343400000A2560,,,,,,,,,,,,,0,,,,,S,sols,,,15,4.138895,43.729795
2020-478429,2020-07-01,000001,Vente terrain à bâtir,159000,684,,CHEMIN DE MONTPELLIER,B003,34400,34340,Villetelle,34,,,343400000A2472,,,,,,,,,,,,,0,1,Maison,162,5,AB,terrains a bâtir,,,427,4.135082,43.728208
2020-478429,2020-07-01,000001,Vente terrain à bâtir,159000,684,,CHEMIN DE MONTPELLIER,B003,34400,34340,Villetelle,34,,,343400000A2472,,,,,,,,,,,,,0,3,Dépendance,,0,AB,terrains a bâtir,,,427,4.135082,43.728208
2020-478541,2020-07-10,000001,Vente,154000,,,LE GRES,B013,34400,34340,Villetelle,34,,,343400000A2516,,,,,,,,,,,,,0,,,,,AB,terrains a bâtir,,,234,4.138956,43.72976
2020-478541,2020-07-10,000001,Vente,154000,,,LE GRES,B013,34400,34340,Villetelle,34,,,343400000A2546,,,,,,,,,,,,,0,,,,,AB,terrains a bâtir,,,121,4.13894,43.729826
2020-478541,2020-07-10,000001,Vente,154000,,,LE GRES,B013,34400,34340,Villetelle,34,,,343400000A2560,,,,,,,,,,,,,0,,,,,S,sols,,,15,4.138895,43.729795
2020-478803,2020-07-10,000001,Vente,75000,,,LE GRES,B013,34400,34340,Villetelle,34,,,343400000A2552,,,,,,,,,,,,,0,,,,,AB,terrains a bâtir,,,152,4.13958,43.730514
2020-479112,2020-07-31,000001,Vente,305000,441,,CHE DE MONTPELLIER,0026,34400,34340,Villetelle,34,,,343400000A1663,,,,,,,,,,,,,0,,,,,S,sols,,,200,4.137578,43.729128
2020-479112,2020-07-31,000001,Vente,305000,441,,CHE DE MONTPELLIER,0026,34400,34340,Villetelle,34,,,343400000A1665,,,,,,,,,,,,,0,1,Maison,99,4,AG,terrains d'agrément,,,1057,4.138124,43.729051
2020-479112,2020-07-31,000001,Vente,305000,441,,CHE DE MONTPELLIER,0026,34400,34340,Villetelle,34,,,343400000A1665,,,,,,,,,,,,,0,1,Maison,99,4,S,sols,,,500,4.138124,43.729051
2020-479276,2020-07-29,000001,Vente,137500,8,B,IMP DU CANTONAT,0014,34400,34340,Villetelle,34,,,343400000A0208,,,,,,,,,,,,,0,1,Maison,63,3,S,sols,,,48,4.140228,43.733021
2020-479349,2020-07-31,000001,Vente,510000,34,,CHE DES CARRIERES,0009,34400,34340,Villetelle,34,,,343400000B0486,,,,,,,,,,,,,0,1,Maison,142,5,S,sols,,,500,4.134979,43.731047
2020-479349,2020-07-31,000001,Vente,510000,34,,CHE DES CARRIERES,0009,34400,34340,Villetelle,34,,,343400000B0486,,,,,,,,,,,,,0,1,Maison,142,5,AG,terrains d'agrément,,,633,4.134979,43.731047
2020-479548,2020-08-20,000001,Vente,172500,,,LE GRES,B013,34400,34340,Villetelle,34,,,343400000A2528,,,,,,,,,,,,,0,,,,,AB,terrains a bâtir,,,450,4.138838,43.730109
2020-480248,2020-08-27,000001,Vente,138000,,,LE GRES,B013,34400,34340,Villetelle,34,,,343400000A2490,,,,,,,,,,,,,0,,,,,AB,terrains a bâtir,,,300,4.140104,43.731574
2020-480274,2020-08-26,000001,Vente,30000,,,COMBE NOIRE,B004,34400,34340,Villetelle,34,,,343400000A2510,,,,,,,,,,,,,0,,,,,T,terres,,,800,4.133909,43.721901
2020-480786,2020-09-30,000001,Vente,591700,899,,CHEMIN DE MONTPELLIER,B003,34400,34340,Villetelle,34,,,343400000A1672,,,,,,,,,,,,,0,1,Maison,166,5,S,sols,,,500,4.134251,43.726578
2020-480786,2020-09-30,000001,Vente,591700,899,,CHEMIN DE MONTPELLIER,B003,34400,34340,Villetelle,34,,,343400000A1672,,,,,,,,,,,,,0,1,Maison,166,5,AG,terrains d'agrément,,,690,4.134251,43.726578
2020-480786,2020-09-30,000001,Vente,591700,,,LE GRES,B013,34400,34340,Villetelle,34,,,343400000A1949,,,,,,,,,,,,,0,,,,,L,landes,,,575,4.134502,43.726424
2020-480957,2020-09-21,000001,Vente,390000,134,,CHE DE LUNEL,0025,34400,34340,Villetelle,34,,,343400000A1845,,,,,,,,,,,,,0,1,Maison,116,4,S,sols,,,1000,4.136771,43.720129
2020-480994,2020-10-08,000001,Vente,158500,,,LE GRES,B013,34400,34340,Villetelle,34,,,343400000A2541,,,,,,,,,,,,,0,,,,,AB,terrains a bâtir,,,400,4.140078,43.730909
2020-481039,2020-10-15,000001,Vente,277120,176,,CHE DE LUNEL,0025,34400,34340,Villetelle,34,,,343400000A2329,,,,,,,,,,,,,0,1,Maison,100,4,S,sols,,,448,4.136545,43.720015
2020-481600,2020-10-13,000001,Vente,288072.22,6,,IMP DU CANTONAT,0014,34400,34340,Villetelle,34,,,343400000A2106,,,,,,,,,,,,,0,1,Maison,207,7,S,sols,,,158,4.140281,43.733157
2020-481812,2020-10-26,000001,Vente,138000,,,LE GRES,B013,34400,34340,Villetelle,34,,,343400000A2491,,,,,,,,,,,,,0,,,,,AB,terrains a bâtir,,,300,4.140021,43.731702
2020-482107,2020-10-27,000001,Vente,174500,,,LE GRES,B013,34400,34340,Villetelle,34,,,343400000A2515,,,,,,,,,,,,,0,,,,,AB,terrains a bâtir,,,449,4.139178,43.729643
2020-482160,2020-11-03,000001,Vente,150,422,,CHE DES COMBES NOIRES,0013,34400,34340,Villetelle,34,,,343400000A2508,,,,,,,,,,,,,0,,,,,S,sols,,,30,4.136112,43.722065
2020-482160,2020-11-03,000001,Vente,150,422,,CHE DES COMBES NOIRES,0013,34400,34340,Villetelle,34,,,343400000A2509,,,,,,,,,,,,,0,,,,,S,sols,,,61,4.136312,43.722012
2020-482209,2020-11-20,000002,Vente,226000,,,LES PIERRES,B021,34400,34340,Villetelle,34,,,343400000B0673,,,,,,,,,,,,,0,,,,,S,sols,,,107,4.137166,43.732715
2020-482209,2020-11-20,000002,Vente,226000,188,,RTE DE SATURARGUES,0054,34400,34340,Villetelle,34,,,343400000B0711,,,,,,,,,,,,,0,1,Maison,72,3,S,sols,,,407,4.137434,43.732643
2020-482209,2020-11-20,000002,Vente,226000,188,,RTE DE SATURARGUES,0054,34400,34340,Villetelle,34,,,343400000B0712,,,,,,,,,,,,,0,,,,,S,sols,,,497,4.137413,43.732735
2020-482218,2020-11-20,000001,Vente,178000,,,LE GRES,B013,34400,34340,Villetelle,34,,,343400000A2534,,,,,,,,,,,,,0,,,,,AB,terrains a bâtir,,,450,4.139276,43.730806
2020-482225,2020-11-16,000001,Vente,155000,684,,CHEMIN DE MONTPELLIER,B003,34400,34340,Villetelle,34,,,343400000A2473,,,,,,,,,,,,,0,,,,,AB,terrains a bâtir,,,401,4.135089,43.727895
2020-482557,2020-11-16,000001,Vente,174500,,,LE GRES,B013,34400,34340,Villetelle,34,,,343400000A2514,,,,,,,,,,,,,0,,,,,AB,terrains a bâtir,,,332,4.13936,43.729779
2020-482557,2020-11-16,000001,Vente,174500,,,LE GRES,B013,34400,34340,Villetelle,34,,,343400000A2523,,,,,,,,,,,,,0,,,,,AB,terrains a bâtir,,,118,4.139504,43.729793
2020-482589,2020-12-02,000001,Vente,75000,,,LE GRES,B013,34400,34340,Villetelle,34,,,343400000A2550,,,,,,,,,,,,,0,,,,,AB,terrains a bâtir,,,152,4.139496,43.730218
2020-482618,2020-11-30,000002,Vente,108000,82,,RTE DE SATURARGUES,0054,34400,34340,Villetelle,34,,,343400000B0716,,,,,,,,,,,,,0,,,,,S,sols,,,28,4.138331,43.733266
2020-482664,2020-12-03,000001,Vente,194850,2,,PL DU PORCHE,0040,34400,34340,Villetelle,34,,,343400000A0176,,,,,,,,,,,,,0,1,Maison,100,4,S,sols,,,21,4.139942,43.734375
2020-482664,2020-12-03,000001,Vente,194850,,,LE VILLAGE,B026,34400,34340,Villetelle,34,,,343400000A0177,,,,,,,,,,,,,0,,,,,S,sols,,,45,4.13984,43.734371
2020-482676,2020-11-23,000001,Vente,422000,6103,F,CHE DES AMANDIERS,0003,34400,34340,Villetelle,34,,,343400000A1641,,,,,,,,,,,,,0,1,Maison,103,4,S,sols,,,1051,4.136056,43.731061
2020-482771,2020-11-23,000001,Vente,5220,,,CHEMIN DE MARSILLARGUES,B002,34400,34340,Villetelle,34,,,343400000A0057,,,,,,,,,,,,,0,,,,,VE,vergers,OLIVE,Oliveraie ou oliviers,3480,4.14381,43.729173
2020-482776,2020-12-09,000001,Vente,187100,2,,CHE DE LA ROQUE,0045,34400,34340,Villetelle,34,,,343400000A1229,,,,,,,,,,,,,0,1,Maison,84,4,S,sols,,,122,4.139434,43.733797
2020-482785,2020-12-02,000001,Vente,169000,,,LE GRES,B013,34400,34340,Villetelle,34,,,343400000A2538,,,,,,,,,,,,,0,,,,,AB,terrains a bâtir,,,400,4.140171,43.731443
2020-482867,2020-12-09,000001,Vente,170000,,,LE GRES,B013,34400,34340,Villetelle,34,,,343400000A2574,,,,,,,,,,,,,0,,,,,S,sols,,,480,4.133805,43.723842
2020-483070,2020-12-10,000001,Vente,165000,188,,RTE DE SATURARGUES,0054,34400,34340,Villetelle,34,,,343400000B0711,,,,,,,,,,,,,0,1,Maison,72,3,S,sols,,,407,4.137434,43.732643
2020-483818,2020-12-18,000001,Vente,1067360.9,,,LE GRES,B013,34400,34340,Villetelle,34,,,343400000A2554,,,,,,,,,,,,,0,,,,,S,sols,,,891,4.139293,43.730406
2020-483828,2020-12-28,000001,Vente,184000,,,LE GRES,B013,34400,34340,Villetelle,34,,,343400000A2532,,,,,,,,,,,,,0,,,,,AB,terrains a bâtir,,,500,4.138985,43.73055
2020-483841,2020-12-29,000001,Vente,174900,,,LE GRES,B013,34400,34340,Villetelle,34,,,343400000A2529,,,,,,,,,,,,,0,,,,,AB,terrains a bâtir,,,452,4.139132,43.730168
2020-484106,2020-12-30,000001,Vente,320000,4,,PL DU PORCHE,0040,34400,34340,Villetelle,34,,,343400000A0179,,,,,,,,,,,,,0,3,Dépendance,,0,S,sols,,,270,4.139824,43.734274
2020-484106,2020-12-30,000001,Vente,320000,4,,PL DU PORCHE,0040,34400,34340,Villetelle,34,,,343400000A0179,,,,,,,,,,,,,0,2,Appartement,80,3,S,sols,,,270,4.139824,43.734274
2020-484106,2020-12-30,000001,Vente,320000,4,,PL DU PORCHE,0040,34400,34340,Villetelle,34,,,343400000A0179,,,,,,,,,,,,,0,2,Appartement,125,3,S,sols,,,270,4.139824,43.734274
2020-484106,2020-12-30,000001,Vente,320000,4,,PL DU PORCHE,0040,34400,34340,Villetelle,34,,,343400000A0179,,,,,,,,,,,,,0,2,Appartement,48,2,S,sols,,,270,4.139824,43.734274
