id_mutation,date_mutation,numero_disposition,nature_mutation,valeur_fonciere,adresse_numero,adresse_suffixe,adresse_nom_voie,adresse_code_voie,code_postal,code_commune,nom_commune,code_departement,ancien_code_commune,ancien_nom_commune,id_parcelle,ancien_id_parcelle,numero_volume,lot1_numero,lot1_surface_carrez,lot2_numero,lot2_surface_carrez,lot3_numero,lot3_surface_carrez,lot4_numero,lot4_surface_carrez,lot5_numero,lot5_surface_carrez,nombre_lots,code_type_local,type_local,surface_reelle_bati,nombre_pieces_principales,code_nature_culture,nature_culture,code_nature_culture_speciale,nature_culture_speciale,surface_terrain,longitude,latitude
2020-516661,2020-01-06,000001,Vente,25000,,,PRE DE LA PORTE,B456,35190,35056,La Chapelle-aux-Filtzméens,35,,,350560000B0858,,,,,,,,,,,,,0,,,,,P,prés,,,1210,-1.811575,48.379666
2020-516937,2020-02-06,000001,Vente,53000,,,TREFUMEL,B522,35190,35056,La Chapelle-aux-Filtzméens,35,,,350560000B1186,,,,,,,,,,,,,0,,,,,J,jardins,POTAG,Jardin potager,382,-1.810726,48.379267
2020-516937,2020-02-06,000001,Vente,53000,5109,,TREFUMEL,B522,35190,35056,La Chapelle-aux-Filtzméens,35,,,350560000B1188,,,,,,,,,,,,,0,1,Maison,46,2,S,sols,,,528,-1.810541,48.379103
2020-517028,2020-02-14,000001,Vente,150000,4,,PL DE L EGLISE,0032,35190,35056,La Chapelle-aux-Filtzméens,35,,,350560000B1018,,,,,,,,,,,,,0,1,Maison,130,6,S,sols,,,128,-1.825483,48.383925
2020-517179,2020-01-31,000001,Vente,8025,,,PRE DE LA MARE,B454,35190,35056,La Chapelle-aux-Filtzméens,35,,,350560000B0263,,,,,,,,,,,,,0,,,,,P,prés,,,2480,-1.804577,48.37292
2020-517179,2020-01-31,000001,Vente,8025,,,LA ROCHE EGUE,B504,35190,35056,La Chapelle-aux-Filtzméens,35,,,350560000B0288,,,,,,,,,,,,,0,,,,,T,terres,,,5820,-1.805998,48.373869
2020-517179,2020-01-31,000001,Vente,8025,,,LA VILLE OZOUF,B547,35190,35056,La Chapelle-aux-Filtzméens,35,,,350560000B0806,,,,,,,,,,,,,0,,,,,T,terres,,,8900,-1.80756,48.373435
2020-517179,2020-01-31,000001,Vente,8025,,,LA VILLE OZOUF,B547,35190,35056,La Chapelle-aux-Filtzméens,35,,,350560000B0807,,,,,,,,,,,,,0,,,,,T,terres,,,3080,-1.80754,48.373119
2020-517179,2020-01-31,000001,Vente,8025,,,LA VILLE OZOUF,B547,35190,35056,La Chapelle-aux-Filtzméens,35,,,350560000B0808,,,,,,,,,,,,,0,,,,,T,terres,,,4630,-1.807568,48.372902
2020-517179,2020-01-31,000001,Vente,8025,,,PRE DE LA MARE,B454,35190,35056,La Chapelle-aux-Filtzméens,35,,,350560000B0809,,,,,,,,,,,,,0,,,,,P,prés,,,1140,-1.80855,48.373297
2020-517179,2020-01-31,000001,Vente,8025,,,PRE DE LA MARE,B454,35190,35056,La Chapelle-aux-Filtzméens,35,,,350560000B0810,,,,,,,,,,,,,0,,,,,P,prés,,,700,-1.808702,48.373622
2020-517566,2020-03-11,000001,Vente,71500,5149,,LE BOURG,B017,35190,35056,La Chapelle-aux-Filtzméens,35,,,350560000B1557,,,,,,,,,,,,,0,3,Dépendance,,0,S,sols,,,500,-1.824217,48.383605
2020-517566,2020-03-11,000001,Vente,71500,5149,,LE BOURG,B017,35190,35056,La Chapelle-aux-Filtzméens,35,,,350560000B1557,,,,,,,,,,,,,0,3,Dépendance,,0,AG,terrains d'agrément,,,989,-1.824217,48.383605
2020-517639,2020-03-09,000001,Vente,52000,,,BASSE PORTE,B006,35190,35056,La Chapelle-aux-Filtzméens,35,,,350560000A0988,,,,,,,,,,,,,0,,,,,J,jardins,POTAG,Jardin potager,378,-1.834838,48.377497
2020-517639,2020-03-09,000001,Vente,52000,,,CASSE PORTE,B024,35190,35056,La Chapelle-aux-Filtzméens,35,,,350560000A0990,,,,,,,,,,,,,0,,,,,J,jardins,POTAG,Jardin potager,301,-1.834897,48.377336
2020-517757,2020-02-17,000001,Vente,59400,1,,ALL DE L ONGRAIE,0052,35190,35056,La Chapelle-aux-Filtzméens,35,,,350560000B1502,,,,,,,,,,,,,0,1,Maison,110,5,S,sols,,,500,-1.824739,48.382703
2020-517757,2020-02-17,000001,Vente,59400,1,,ALL DE L ONGRAIE,0052,35190,35056,La Chapelle-aux-Filtzméens,35,,,350560000B1502,,,,,,,,,,,,,0,1,Maison,110,5,AG,terrains d'agrément,,,223,-1.824739,48.382703
2020-517815,2020-04-10,000001,Vente,208500,15,,ALL DE L ONGRAIE,0052,35190,35056,La Chapelle-aux-Filtzméens,35,,,350560000B1500,,,,,,,,,,,,,0,1,Maison,121,6,AG,terrains d'agrément,,,336,-1.825297,48.382514
2020-517815,2020-04-10,000001,Vente,208500,15,,ALL DE L ONGRAIE,0052,35190,35056,La Chapelle-aux-Filtzméens,35,,,350560000B1500,,,,,,,,,,,,,0,1,Maison,121,6,S,sols,,,500,-1.825297,48.382514
2020-518054,2020-05-11,000001,Vente,2400,,,LA GRANDE ROCHELLE,B265,35190,35056,La Chapelle-aux-Filtzméens,35,,,350560000B1253,,,,,,,,,,,,,0,,,,,T,terres,,,4925,-1.816274,48.385483
2020-519278,2020-07-30,000001,Vente,202728,,,LES PLESSES,B430,35190,35056,La Chapelle-aux-Filtzméens,35,,,350560000A0242,,,,,,,,,,,,,0,,,,,P,prés,,,4900,-1.834102,48.379922
2020-519278,2020-07-30,000001,Vente,202728,,,LES PLESSES,B430,35190,35056,La Chapelle-aux-Filtzméens,35,,,350560000A0243,,,,,,,,,,,,,0,,,,,P,prés,,,2060,-1.834912,48.379724
2020-519278,2020-07-30,000001,Vente,202728,,,LA FRECHE,B214,35190,35056,La Chapelle-aux-Filtzméens,35,,,350560000A0244,,,,,,,,,,,,,0,,,,,P,prés,,,1220,-1.835063,48.379326
2020-519278,2020-07-30,000001,Vente,202728,,,LA TAVERNE,B516,35190,35056,La Chapelle-aux-Filtzméens,35,,,350560000A0245,,,,,,,,,,,,,0,,,,,T,terres,,,2330,-1.835046,48.3789
2020-519278,2020-07-30,000001,Vente,202728,5,,LE VILLAGE,B542,35190,35056,La Chapelle-aux-Filtzméens,35,,,350560000A0246,,,,,,,,,,,,,0,1,Maison,90,4,S,sols,,,674,-1.834799,48.378537
2020-519278,2020-07-30,000001,Vente,202728,,,PETIT COURTIL,B386,35190,35056,La Chapelle-aux-Filtzméens,35,,,350560000A0248,,,,,,,,,,,,,0,,,,,L,landes,,,260,-1.835347,48.37843
2020-519278,2020-07-30,000001,Vente,202728,,,COURTIL HOUITTE,B183,35190,35056,La Chapelle-aux-Filtzméens,35,,,350560000A0249,,,,,,,,,,,,,0,,,,,L,landes,,,820,-1.835404,48.379041
2020-519278,2020-07-30,000001,Vente,202728,,,PRE DE LARNOIE,B461,35190,35056,La Chapelle-aux-Filtzméens,35,,,350560000A0635,,,,,,,,,,,,,0,,,,,P,prés,,,3460,-1.834328,48.379243
2020-519278,2020-07-30,000001,Vente,202728,,,COURTIL HUET,B184,35190,35056,La Chapelle-aux-Filtzméens,35,,,350560000A0661,,,,,,,,,,,,,0,,,,,L,landes,,,747,-1.835494,48.378763
2020-519278,2020-07-30,000001,Vente,202728,,,LA COUR BRUNETTE,B140,35190,35056,La Chapelle-aux-Filtzméens,35,,,350560000A0662,,,,,,,,,,,,,0,,,,,T,terres,,,19,-1.835465,48.378553
2020-519278,2020-07-30,000001,Vente,202728,,,LA COUR BRUNETTE,B140,35190,35056,La Chapelle-aux-Filtzméens,35,,,350560000A0664,,,,,,,,,,,,,0,,,,,T,terres,,,9,-1.835441,48.378391
2020-519278,2020-07-30,000001,Vente,202728,,,PRE DE LARNOIE,B461,35190,35056,La Chapelle-aux-Filtzméens,35,,,350560000A0865,,,,,,,,,,,,,0,,,,,S,sols,,,569,-1.834692,48.379259
2020-519278,2020-07-30,000001,Vente,202728,,,LA FRECHE,B214,35190,35056,La Chapelle-aux-Filtzméens,35,,,350560000A0986,,,,,,,,,,,,,0,,,,,L,landes,,,448,-1.835162,48.378547
2020-519278,2020-07-30,000001,Vente,202728,,,LA FRECHE,B214,35190,35056,La Chapelle-aux-Filtzméens,35,,,350560000A0987,,,,,,,,,,,,,0,,,,,L,landes,,,152,-1.835007,48.378565
2020-519360,2020-07-29,000001,Vente,210000,5118,,LE BOURG,B017,35190,35056,La Chapelle-aux-Filtzméens,35,,,350560000B0988,,,,,,,,,,,,,0,1,Maison,92,3,S,sols,,,510,-1.82552,48.383613
2020-519360,2020-07-29,000001,Vente,210000,5118,,LE BOURG,B017,35190,35056,La Chapelle-aux-Filtzméens,35,,,350560000B0988,,,,,,,,,,,,,0,4,Local industriel. commercial ou assimilé,108,0,S,sols,,,510,-1.82552,48.383613
2020-519360,2020-07-29,000001,Vente,210000,,,L ONGRAIE,B361,35190,35056,La Chapelle-aux-Filtzméens,35,,,350560000B1240,,,,,,,,,,,,,0,,,,,J,jardins,POTAG,Jardin potager,711,-1.825662,48.383296
2020-519474,2020-08-28,000001,Vente,500,,,VALLEE DU VAULT PICOT,B528,35190,35056,La Chapelle-aux-Filtzméens,35,,,350560000B0040,,,,,,,,,,,,,0,,,,,BT,taillis simples,,,1270,-1.795218,48.382623
2020-519753,2020-08-28,000001,Vente,35200,,,LE GRAND PRE,B248,35190,35056,La Chapelle-aux-Filtzméens,35,,,350560000B0769,,,,,,,,,,,,,0,,,,,P,prés,,,2740,-1.805949,48.381314
2020-519753,2020-08-28,000001,Vente,35200,,,COURTIL TANGUY,B187,35190,35056,La Chapelle-aux-Filtzméens,35,,,350560000B1195,,,,,,,,,,,,,0,,,,,J,jardins,POTAG,Jardin potager,524,-1.806306,48.381927
2020-519753,2020-08-28,000001,Vente,35200,,,LE BOUILLON,B016,35190,35056,La Chapelle-aux-Filtzméens,35,,,350560000B1337,,,,,,,,,,,,,0,,,,,S,sols,,,34,-1.805904,48.381665
2020-519753,2020-08-28,000001,Vente,35200,,,LE BOUILLON,B016,35190,35056,La Chapelle-aux-Filtzméens,35,,,350560000B1339,,,,,,,,,,,,,0,,,,,S,sols,,,160,-1.806066,48.381773
2020-519753,2020-08-28,000001,Vente,35200,,,LE BOUILLON,B016,35190,35056,La Chapelle-aux-Filtzméens,35,,,350560000B1340,,,,,,,,,,,,,0,,,,,S,sols,,,37,-1.80582,48.381821
2020-519753,2020-08-28,000001,Vente,35200,5068,,LE BOUILLON,B016,35190,35056,La Chapelle-aux-Filtzméens,35,,,350560000B1342,,,,,,,,,,,,,0,1,Maison,48,1,S,sols,,,140,-1.805952,48.381858
2020-519753,2020-08-28,000001,Vente,35200,,,LES FONTAINES,B209,35190,35056,La Chapelle-aux-Filtzméens,35,,,350560000B1344,,,,,,,,,,,,,0,,,,,T,terres,,,1846,-1.805696,48.381808
2020-520165,2020-09-29,000001,Vente,62235,2,,RUE CHATEAUBRIAND,0008,35190,35056,La Chapelle-aux-Filtzméens,35,,,350560000B1272,,,,,,,,,,,,,0,1,Maison,40,2,S,sols,,,32,-1.824076,48.383889
2020-520275,2020-09-23,000002,Vente,177000,5,,RUE DES COLLINES,0014,35190,35056,La Chapelle-aux-Filtzméens,35,,,350560000B1755,,,,,,,,,,,,,0,1,Maison,87,3,,,,,,-1.823068,48.3836
2020-520668,2020-11-09,000001,Vente,200000,,,COURTIL DE LA COUTURE,B164,35190,35056,La Chapelle-aux-Filtzméens,35,,,350560000A0078,,,,,,,,,,,,,0,,,,,T,terres,,,990,-1.824505,48.386059
2020-520668,2020-11-09,000001,Vente,200000,15,,RUE DES DEUX CROIX,0027,35190,35056,La Chapelle-aux-Filtzméens,35,,,350560000A0701,,,,,,,,,,,,,0,1,Maison,89,4,S,sols,,,606,-1.824117,48.386241
2020-520668,2020-11-09,000001,Vente,200000,15,,RUE DES DEUX CROIX,0027,35190,35056,La Chapelle-aux-Filtzméens,35,,,350560000A0701,,,,,,,,,,,,,0,3,Dépendance,,0,S,sols,,,606,-1.824117,48.386241
2020-521496,2020-12-11,000001,Vente,150000,1,T,RUE DU PRESBYTERE,0061,35190,35056,La Chapelle-aux-Filtzméens,35,,,350560000A0843,,,,,,,,,,,,,0,1,Maison,94,5,S,sols,,,726,-1.825018,48.386491
2020-521765,2020-12-18,000001,Vente,3000,,,LA GAGNE,B218,35190,35056,La Chapelle-aux-Filtzméens,35,,,350560000B0873,,,,,,,,,,,,,0,,,,,T,terres,,,7130,-1.812559,48.37691
2020-521811,2020-12-21,000001,Vente,232000,8,,ALL DE L AUBEPINE,0002,35190,35056,La Chapelle-aux-Filtzméens,35,,,350560000B1553,,,,,,,,,,,,,0,1,Maison,173,6,S,sols,,,780,-1.82316,48.385931
