id_mutation,date_mutation,numero_disposition,nature_mutation,valeur_fonciere,adresse_numero,adresse_suffixe,adresse_nom_voie,adresse_code_voie,code_postal,code_commune,nom_commune,code_departement,ancien_code_commune,ancien_nom_commune,id_parcelle,ancien_id_parcelle,numero_volume,lot1_numero,lot1_surface_carrez,lot2_numero,lot2_surface_carrez,lot3_numero,lot3_surface_carrez,lot4_numero,lot4_surface_carrez,lot5_numero,lot5_surface_carrez,nombre_lots,code_type_local,type_local,surface_reelle_bati,nombre_pieces_principales,code_nature_culture,nature_culture,code_nature_culture_speciale,nature_culture_speciale,surface_terrain,longitude,latitude
2020-524243,2020-01-10,000001,Vente,26000,5128,,LA SAINSONNERIE,B136,36290,36212,Saulnay,36,,,36212000YA0012,,,,,,,,,,,,,0,1,Maison,58,2,J,jardins,,,2066,1.246206,46.881709
2020-524243,2020-01-10,000001,Vente,26000,5128,,LA SAINSONNERIE,B136,36290,36212,Saulnay,36,,,36212000YA0012,,,,,,,,,,,,,0,1,Maison,58,2,S,sols,,,1100,1.246206,46.881709
2020-524243,2020-01-10,000001,Vente,26000,,,LA SAINSONNERIE,B136,36290,36212,Saulnay,36,,,36212000ZC0021,,,,,,,,,,,,,0,,,,,J,jardins,,,1251,1.247341,46.881975
2020-524271,2020-01-13,000001,Vente,44238.6,,,LES ESSARTS,B049,36290,36212,Saulnay,36,,,36212000ZR0003,,,,,,,,,,,,,0,,,,,BT,taillis simples,,,12069,1.240622,46.866877
2020-524271,2020-01-13,000001,Vente,44238.6,,,LA LANDE DE NOTZ,B078,36290,36212,Saulnay,36,,,36212000ZS0003,,,,,,,,,,,,,0,,,,,BS,taillis sous futaie,,,61662,1.238641,46.86598
2020-524526,2020-02-06,000001,Vente,105000,5143,,LA RABATTERIE,B127,36290,36212,Saulnay,36,,,36212000ZE0005,,,,,,,,,,,,,0,1,Maison,58,2,S,sols,,,300,1.264974,46.872286
2020-524526,2020-02-06,000001,Vente,105000,5143,,LA RABATTERIE,B127,36290,36212,Saulnay,36,,,36212000ZE0005,,,,,,,,,,,,,0,1,Maison,58,2,J,jardins,,,1113,1.264974,46.872286
2020-526233,2020-06-23,000001,Vente,7000,,,LE BOUCHET,B012,36290,36212,Saulnay,36,,,36212000ZN0024,,,,,,,,,,,,,0,,,,,BR,futaies résineuses,,,2353,1.270477,46.85996
2020-526233,2020-06-23,000001,Vente,7000,,,LE BOUCHET,B012,36290,36212,Saulnay,36,,,36212000ZN0024,,,,,,,,,,,,,0,,,,,BT,taillis simples,,,4707,1.270477,46.85996
2020-526233,2020-06-23,000001,Vente,7000,,,LES CAILLOTTES,B020,36290,36212,Saulnay,36,,,36212000ZT0033,,,,,,,,,,,,,0,,,,,BR,futaies résineuses,,,1776,1.243254,46.856228
2020-526233,2020-06-23,000001,Vente,7000,,,LES CAILLOTTES,B020,36290,36212,Saulnay,36,,,36212000ZT0044,,,,,,,,,,,,,0,,,,,BS,taillis sous futaie,,,6452,1.240488,46.855059
2020-526730,2020-07-21,000001,Vente,15500,5184,,LA CHAUME DES ROSEAUX,B030,36290,36212,Saulnay,36,,,36212000ZH0027,,,,,,,,,,,,,0,3,Dépendance,,0,E,eaux,ETANG,Etangs,2163,1.27474,46.869452
2020-526730,2020-07-21,000001,Vente,15500,5184,,LA CHAUME DES ROSEAUX,B030,36290,36212,Saulnay,36,,,36212000ZH0027,,,,,,,,,,,,,0,3,Dépendance,,0,P,prés,,,12705,1.27474,46.869452
2020-527195,2020-08-28,000001,Vente,97700,21,,RTE DE MEZIERES,0460,36290,36212,Saulnay,36,,,362120000C0909,,,,,,,,,,,,,0,1,Maison,92,5,S,sols,,,507,1.26917,46.867301
2020-527195,2020-08-28,000001,Vente,97700,21,,RTE DE MEZIERES,0460,36290,36212,Saulnay,36,,,362120000C0912,,,,,,,,,,,,,0,3,Dépendance,,0,S,sols,,,155,1.268863,46.867309
2020-527467,2020-09-18,000001,Vente,4000,,,LE DESSUS DE SAULNAY,B040,36290,36212,Saulnay,36,,,36212000ZO0018,,,,,,,,,,,,,0,,,,,P,prés,,,9123,1.26375,46.867304
2020-527946,2020-10-12,000001,Vente,6500,,,LES BOURDELOTS,B015,36290,36212,Saulnay,36,,,36212000ZD0037,,,,,,,,,,,,,0,,,,,BR,futaies résineuses,,,8211,1.251723,46.872783
2020-527946,2020-10-12,000001,Vente,6500,,,LE BOUCHET,B012,36290,36212,Saulnay,36,,,36212000ZN0035,,,,,,,,,,,,,0,,,,,T,terres,,,2556,1.271719,46.859096
2020-527946,2020-10-12,000001,Vente,6500,,,LE BOUCHET,B012,36290,36212,Saulnay,36,,,36212000ZN0036,,,,,,,,,,,,,0,,,,,BR,futaies résineuses,,,3071,1.271732,46.858865
2020-528275,2020-10-13,000001,Vente,100000,4,,RTE DES HEROLLES,0250,36290,36212,Saulnay,36,,,362120000C1061,,,,,,,,,,,,,0,1,Maison,100,5,S,sols,,,456,1.248199,46.858014
2020-528275,2020-10-13,000001,Vente,100000,4,,RTE DES HEROLLES,0250,36290,36212,Saulnay,36,,,362120000C1061,,,,,,,,,,,,,0,3,Dépendance,,0,S,sols,,,456,1.248199,46.858014
2020-528275,2020-10-13,000001,Vente,100000,4,,RTE DES HEROLLES,0250,36290,36212,Saulnay,36,,,362120000C1061,,,,,,,,,,,,,0,3,Dépendance,,0,S,sols,,,456,1.248199,46.858014
2020-528275,2020-10-13,000001,Vente,100000,,,LA GIRARDETTERIE,B064,36290,36212,Saulnay,36,,,362120000C1062,,,,,,,,,,,,,0,,,,,S,sols,,,177,1.248054,46.857882
2020-528275,2020-10-13,000001,Vente,100000,,,LA GIRARDETTERIE,B064,36290,36212,Saulnay,36,,,362120000C1062,,,,,,,,,,,,,0,,,,,J,jardins,,,286,1.248054,46.857882
2020-528275,2020-10-13,000001,Vente,100000,,,LA GIRARDETTERIE,B064,36290,36212,Saulnay,36,,,362120000C1063,,,,,,,,,,,,,0,,,,,J,jardins,,,234,1.248247,46.857787
2020-528759,2020-11-26,000001,Vente,51000,4,,RTE DE PAULNAY,0500,36290,36212,Saulnay,36,,,362120000C0929,,,,,,,,,,,,,0,1,Maison,76,3,S,sols,,,614,1.268422,46.869119
