id_mutation,date_mutation,numero_disposition,nature_mutation,valeur_fonciere,adresse_numero,adresse_suffixe,adresse_nom_voie,adresse_code_voie,code_postal,code_commune,nom_commune,code_departement,ancien_code_commune,ancien_nom_commune,id_parcelle,ancien_id_parcelle,numero_volume,lot1_numero,lot1_surface_carrez,lot2_numero,lot2_surface_carrez,lot3_numero,lot3_surface_carrez,lot4_numero,lot4_surface_carrez,lot5_numero,lot5_surface_carrez,nombre_lots,code_type_local,type_local,surface_reelle_bati,nombre_pieces_principales,code_nature_culture,nature_culture,code_nature_culture_speciale,nature_culture_speciale,surface_terrain,longitude,latitude
2020-524534,2020-01-29,000001,Vente,105000,5047,,LE BOURG,B020,36110,36242,Villegongis,36,,,362420000D0080,,,,,,,,,,,,,0,1,Maison,73,4,S,sols,,,390,1.595177,46.911828
2020-524534,2020-01-29,000001,Vente,105000,5047,,LE BOURG,B020,36110,36242,Villegongis,36,,,362420000D0080,,,,,,,,,,,,,0,1,Maison,73,4,AG,terrains d'agrément,PARC,Parc,311,1.595177,46.911828
2020-524534,2020-01-29,000001,Vente,105000,8,,RUE DU MOULIN,0024,36110,36242,Villegongis,36,,,362420000D0087,,,,,,,,,,,,,0,,,,,S,sols,,,610,1.595551,46.911879
2020-525897,2020-05-13,000001,Vente,143000,14,,RUE DU MOULIN,0024,36110,36242,Villegongis,36,,,362420000D0077,,,,,,,,,,,,,0,1,Maison,111,6,AG,terrains d'agrément,PARC,Parc,297,1.595434,46.911316
2020-525897,2020-05-13,000001,Vente,143000,14,,RUE DU MOULIN,0024,36110,36242,Villegongis,36,,,362420000D0077,,,,,,,,,,,,,0,1,Maison,111,6,S,sols,,,1000,1.595434,46.911316
2020-526182,2020-06-19,000001,Vente,300000,3,,PL DE LA MAIRIE,0022,36110,36242,Villegongis,36,,,362420000C0077,,,,,,,,,,,,,0,2,Appartement,90,4,S,sols,,,1480,1.594877,46.913888
2020-526182,2020-06-19,000001,Vente,300000,3,,PL DE LA MAIRIE,0022,36110,36242,Villegongis,36,,,362420000C0077,,,,,,,,,,,,,0,2,Appartement,155,5,S,sols,,,1480,1.594877,46.913888
2020-526182,2020-06-19,000001,Vente,300000,,,LE BOURG,B020,36110,36242,Villegongis,36,,,362420000C0078,,,,,,,,,,,,,0,,,,,P,prés,,,3410,1.593964,46.913975
2020-526182,2020-06-19,000001,Vente,300000,,,LE BOURG,B020,36110,36242,Villegongis,36,,,362420000C0079,,,,,,,,,,,,,0,,,,,S,sols,,,257,1.59391,46.913734
2020-526182,2020-06-19,000001,Vente,300000,,,LE BOURG,B020,36110,36242,Villegongis,36,,,362420000C0191,,,,,,,,,,,,,0,,,,,BS,taillis sous futaie,,,2404,1.594748,46.913642
2020-526182,2020-06-19,000001,Vente,300000,2,,PL DE LA MAIRIE,0022,36110,36242,Villegongis,36,,,362420000C0249,,,,,,,,,,,,,0,1,Maison,74,3,S,sols,,,187,1.595219,46.913857
2020-526182,2020-06-19,000001,Vente,300000,2,B,PL DE LA MAIRIE,0022,36110,36242,Villegongis,36,,,362420000C0250,,,,,,,,,,,,,0,1,Maison,73,3,S,sols,,,46,1.595234,46.913628
2020-526445,2020-06-02,000001,Vente,1765295,,,LES PRES DE LANCE,B094,36110,36242,Villegongis,36,,,362420000A0037,,,,,,,,,,,,,0,,,,,P,prés,,,12150,1.598775,46.923326
2020-526445,2020-06-02,000001,Vente,1765295,,,LES PRES DE LANCE,B094,36110,36242,Villegongis,36,,,362420000A0038,,,,,,,,,,,,,0,,,,,T,terres,,,4780,1.598587,46.924039
2020-526445,2020-06-02,000001,Vente,1765295,,,LES PRES DE LANCE,B094,36110,36242,Villegongis,36,,,362420000A0039,,,,,,,,,,,,,0,,,,,P,prés,,,3830,,
2020-526445,2020-06-02,000001,Vente,1765295,,,LA PIECE DES BONNES BRUYER,B056,36110,36242,Villegongis,36,,,362420000A0050,,,,,,,,,,,,,0,,,,,P,prés,,,17300,1.599402,46.932948
2020-526445,2020-06-02,000001,Vente,1765295,,,LES BONNES BRUYERES,B016,36110,36242,Villegongis,36,,,362420000A0053,,,,,,,,,,,,,0,,,,,T,terres,,,2200,1.591853,46.935501
2020-526445,2020-06-02,000001,Vente,1765295,5038,,LES BONNES BRUYERES,B016,36110,36242,Villegongis,36,,,362420000A0054,,,,,,,,,,,,,0,1,Maison,137,3,S,sols,,,16650,1.592921,46.934973
2020-526445,2020-06-02,000001,Vente,1765295,,,LES BONNES BRUYERES,B016,36110,36242,Villegongis,36,,,362420000A0055,,,,,,,,,,,,,0,,,,,J,jardins,,,1600,1.593594,46.935226
2020-526445,2020-06-02,000001,Vente,1765295,,,LES BONNES BRUYERES,B016,36110,36242,Villegongis,36,,,362420000A0056,,,,,,,,,,,,,0,,,,,J,jardins,,,1500,1.593112,46.935353
2020-526445,2020-06-02,000001,Vente,1765295,,,LA PIECE DES BONNES BRUYER,B056,36110,36242,Villegongis,36,,,362420000A0092,,,,,,,,,,,,,0,,,,,T,terres,,,287580,1.593485,46.925957
2020-526445,2020-06-02,000001,Vente,1765295,,,LA PIECE DES BONNES BRUYER,B056,36110,36242,Villegongis,36,,,362420000A0092,,,,,,,,,,,,,0,,,,,T,terres,,,287580,1.593485,46.925957
2020-526445,2020-06-02,000001,Vente,1765295,,,LA PIECE DES BONNES BRUYER,B056,36110,36242,Villegongis,36,,,362420000A0093,,,,,,,,,,,,,0,,,,,T,terres,,,348451,,
2020-526445,2020-06-02,000001,Vente,1765295,,,LA PIECE DES BONNES BRUYER,B056,36110,36242,Villegongis,36,,,362420000A0093,,,,,,,,,,,,,0,,,,,T,terres,,,348451,,
2020-526445,2020-06-02,000001,Vente,1765295,,,LA PIECE D HURTEBISE,B043,36110,36242,Villegongis,36,,,362420000C0162,,,,,,,,,,,,,0,,,,,T,terres,,,12527,1.596819,46.922721
2020-526445,2020-06-02,000001,Vente,1765295,,,LA PIECE D HURTEBISE,B043,36110,36242,Villegongis,36,,,362420000C0162,,,,,,,,,,,,,0,,,,,T,terres,,,12527,1.596819,46.922721
2020-526445,2020-06-02,000001,Vente,1765295,,,LA PIECE D HURTEBISE,B043,36110,36242,Villegongis,36,,,362420000C0163,,,,,,,,,,,,,0,,,,,T,terres,,,1428,1.588526,46.926915
2020-526445,2020-06-02,000001,Vente,1765295,,,LA PIECE D HURTEBISE,B043,36110,36242,Villegongis,36,,,362420000C0163,,,,,,,,,,,,,0,,,,,T,terres,,,1428,1.588526,46.926915
2020-526980,2020-06-02,000003,Vente,1837794,,,LES PRES DE LANCE,B094,36110,36242,Villegongis,36,,,362420000A0037,,,,,,,,,,,,,0,,,,,P,prés,,,12150,1.598775,46.923326
2020-526980,2020-06-02,000003,Vente,1837794,,,LES PRES DE LANCE,B094,36110,36242,Villegongis,36,,,362420000A0038,,,,,,,,,,,,,0,,,,,T,terres,,,4780,1.598587,46.924039
2020-526980,2020-06-02,000003,Vente,1837794,,,LA PIECE DES BONNES BRUYER,B056,36110,36242,Villegongis,36,,,362420000A0050,,,,,,,,,,,,,0,,,,,P,prés,,,17300,1.599402,46.932948
2020-526980,2020-06-02,000003,Vente,1837794,,,LA PIECE DES BONNES BRUYER,B056,36110,36242,Villegongis,36,,,362420000A0092,,,,,,,,,,,,,0,,,,,T,terres,,,287580,1.593485,46.925957
2020-526980,2020-06-02,000003,Vente,1837794,,,LA PIECE DES BONNES BRUYER,B056,36110,36242,Villegongis,36,,,362420000A0092,,,,,,,,,,,,,0,,,,,T,terres,,,287580,1.593485,46.925957
2020-526980,2020-06-02,000003,Vente,1837794,,,LA PIECE D HURTEBISE,B043,36110,36242,Villegongis,36,,,362420000C0162,,,,,,,,,,,,,0,,,,,T,terres,,,12527,1.596819,46.922721
2020-526980,2020-06-02,000003,Vente,1837794,,,LA PIECE D HURTEBISE,B043,36110,36242,Villegongis,36,,,362420000C0162,,,,,,,,,,,,,0,,,,,T,terres,,,12527,1.596819,46.922721
2020-526980,2020-06-02,000003,Vente,1837794,,,LA PIECE D HURTEBISE,B043,36110,36242,Villegongis,36,,,362420000C0163,,,,,,,,,,,,,0,,,,,T,terres,,,1428,1.588526,46.926915
2020-526980,2020-06-02,000003,Vente,1837794,,,LA PIECE D HURTEBISE,B043,36110,36242,Villegongis,36,,,362420000C0163,,,,,,,,,,,,,0,,,,,T,terres,,,1428,1.588526,46.926915
