id_mutation,date_mutation,numero_disposition,nature_mutation,valeur_fonciere,adresse_numero,adresse_suffixe,adresse_nom_voie,adresse_code_voie,code_postal,code_commune,nom_commune,code_departement,ancien_code_commune,ancien_nom_commune,id_parcelle,ancien_id_parcelle,numero_volume,lot1_numero,lot1_surface_carrez,lot2_numero,lot2_surface_carrez,lot3_numero,lot3_surface_carrez,lot4_numero,lot4_surface_carrez,lot5_numero,lot5_surface_carrez,nombre_lots,code_type_local,type_local,surface_reelle_bati,nombre_pieces_principales,code_nature_culture,nature_culture,code_nature_culture_speciale,nature_culture_speciale,surface_terrain,longitude,latitude
2020-537081,2020-01-03,000001,Vente,185000,,,LA BARBOTIERE,B004,37330,37036,Braye-sur-Maulne,37,,,370360000B0013,,,,,,,,,,,,,0,,,,,J,jardins,POTAG,Jardin potager,625,0.248162,47.575946
2020-537081,2020-01-03,000001,Vente,185000,91,,LA BARBOTIERE,B004,37330,37036,Braye-sur-Maulne,37,,,370360000B0015,,,,,,,,,,,,,0,1,Maison,120,5,S,sols,,,520,0.248547,47.575969
2020-537081,2020-01-03,000001,Vente,185000,,,LA BARBOTIERE,B004,37330,37036,Braye-sur-Maulne,37,,,370360000B0024,,,,,,,,,,,,,0,,,,,P,prés,,,1800,0.248417,47.575699
2020-537081,2020-01-03,000001,Vente,185000,,,LA BARBOTIERE,B004,37330,37036,Braye-sur-Maulne,37,,,370360000B0594,,,,,,,,,,,,,0,,,,,J,jardins,POTAG,Jardin potager,554,0.248515,47.576033
2020-537081,2020-01-03,000001,Vente,185000,,,LA BARBOTIERE,B004,37330,37036,Braye-sur-Maulne,37,,,370360000B0597,,,,,,,,,,,,,0,,,,,S,sols,,,307,0.24882,47.575919
2020-537081,2020-01-03,000001,Vente,185000,,,LA BARBOTIERE,B004,37330,37036,Braye-sur-Maulne,37,,,370360000B0599,,,,,,,,,,,,,0,,,,,S,sols,,,158,0.248328,47.57585
2020-537081,2020-01-03,000001,Vente,185000,,,LA BARBOTIERE,B004,37330,37036,Braye-sur-Maulne,37,,,370360000B0599,,,,,,,,,,,,,0,,,,,J,jardins,POTAG,Jardin potager,136,0.248328,47.57585
2020-537787,2020-03-31,000001,Vente,158000,98,,LES PETITES BROSSES,B072,37330,37036,Braye-sur-Maulne,37,,,370360000B0161,,,,,,,,,,,,,0,1,Maison,52,2,S,sols,,,840,0.247778,47.572592
2020-537787,2020-03-31,000001,Vente,158000,,,LES PETITES BROSSES,B072,37330,37036,Braye-sur-Maulne,37,,,370360000B0164,,,,,,,,,,,,,0,,,,,T,terres,,,3525,0.246446,47.571321
2020-537787,2020-03-31,000001,Vente,158000,,,LA PROMENADE,B075,37330,37036,Braye-sur-Maulne,37,,,370360000B0170,,,,,,,,,,,,,0,,,,,T,terres,,,3100,0.245163,47.571199
2020-537787,2020-03-31,000001,Vente,158000,,,LES PETITES BROSSES,B072,37330,37036,Braye-sur-Maulne,37,,,370360000B0625,,,,,,,,,,,,,0,,,,,T,terres,,,1280,0.248452,47.57183
2020-537787,2020-03-31,000001,Vente,158000,,,LES PETITES BROSSES,B072,37330,37036,Braye-sur-Maulne,37,,,370360000B0626,,,,,,,,,,,,,0,,,,,T,terres,,,3350,0.24814,47.572267
2020-537787,2020-03-31,000001,Vente,158000,,,LES PETITES BROSSES,B072,37330,37036,Braye-sur-Maulne,37,,,370360000B0627,,,,,,,,,,,,,0,,,,,T,terres,,,210,0.247735,47.57215
2020-537787,2020-03-31,000001,Vente,158000,,,LES PETITES BROSSES,B072,37330,37036,Braye-sur-Maulne,37,,,370360000B0628,,,,,,,,,,,,,0,,,,,T,terres,,,17,0.248015,47.571835
2020-537787,2020-03-31,000001,Vente,158000,,,LES PETITES BROSSES,B072,37330,37036,Braye-sur-Maulne,37,,,370360000B0629,,,,,,,,,,,,,0,,,,,T,terres,,,10783,0.247847,47.571695
2020-537787,2020-03-31,000001,Vente,158000,,,LES PETITES BROSSES,B072,37330,37036,Braye-sur-Maulne,37,,,370360000B0630,,,,,,,,,,,,,0,,,,,T,terres,,,513,0.247574,47.572434
2020-537787,2020-03-31,000001,Vente,158000,,,LES PETITES BROSSES,B072,37330,37036,Braye-sur-Maulne,37,,,370360000B0631,,,,,,,,,,,,,0,,,,,T,terres,,,13459,0.246519,47.57218
2020-539038,2020-08-25,000001,Vente,20000,,,LA RODIERE,B078,37330,37036,Braye-sur-Maulne,37,,,370360000A0523,,,,,,,,,,,,,0,,,,,T,terres,,,1675,0.252341,47.54612
2020-539038,2020-08-25,000001,Vente,20000,,,LA RODIERE,B078,37330,37036,Braye-sur-Maulne,37,,,370360000A0524,,,,,,,,,,,,,0,,,,,T,terres,,,3080,0.252957,47.546248
2020-539038,2020-08-25,000001,Vente,20000,,,LA CAVE,B019,37330,37036,Braye-sur-Maulne,37,,,370360000A0795,,,,,,,,,,,,,0,,,,,T,terres,,,1350,0.249903,47.544035
2020-539038,2020-08-25,000001,Vente,20000,,,LA CAVE,B019,37330,37036,Braye-sur-Maulne,37,,,370360000A0796,,,,,,,,,,,,,0,,,,,T,terres,,,1780,0.2501,47.544343
2020-539038,2020-08-25,000001,Vente,20000,,,LA CAVE,B019,37330,37036,Braye-sur-Maulne,37,,,370360000A0803,,,,,,,,,,,,,0,,,,,T,terres,,,800,0.250044,47.54511
2020-539038,2020-08-25,000001,Vente,20000,81,,LA CAVE,B019,37330,37036,Braye-sur-Maulne,37,,,370360000A0804,,,,,,,,,,,,,0,1,Maison,57,2,S,sols,,,960,0.249767,47.545208
2020-539038,2020-08-25,000001,Vente,20000,,,LA CAVE,B019,37330,37036,Braye-sur-Maulne,37,,,370360000A0805,,,,,,,,,,,,,0,,,,,J,jardins,POTAG,Jardin potager,400,0.249814,47.544958
2020-539038,2020-08-25,000001,Vente,20000,,,LA CAVE,B019,37330,37036,Braye-sur-Maulne,37,,,370360000A0806,,,,,,,,,,,,,0,,,,,J,jardins,POTAG,Jardin potager,1390,0.249733,47.544446
2020-539038,2020-08-25,000001,Vente,20000,,,LA CAVE,B019,37330,37036,Braye-sur-Maulne,37,,,370360000A0809,,,,,,,,,,,,,0,,,,,T,terres,,,2440,0.249064,47.544793
2020-539038,2020-08-25,000001,Vente,20000,,,LA CAVE,B019,37330,37036,Braye-sur-Maulne,37,,,370360000A0813,,,,,,,,,,,,,0,,,,,T,terres,,,18920,0.250168,47.545318
2020-539038,2020-08-25,000001,Vente,20000,,,LA CAVE,B019,37330,37036,Braye-sur-Maulne,37,,,370360000A0861,,,,,,,,,,,,,0,,,,,S,sols,,,15,0.249872,47.544447
2020-539468,2020-09-10,000001,Vente,3200,,,LES MASNIERES,B057,37330,37036,Braye-sur-Maulne,37,,,370360000A0656,,,,,,,,,,,,,0,,,,,T,terres,,,8305,0.274104,47.552447
2020-539468,2020-09-10,000001,Vente,3200,,,LES MASNIERES,B057,37330,37036,Braye-sur-Maulne,37,,,370360000A0657,,,,,,,,,,,,,0,,,,,T,terres,,,3560,0.274503,47.551656
2020-539860,2020-10-15,000001,Vente,75500,69,,LE BOURG,B012,37330,37036,Braye-sur-Maulne,37,,,370360000A0431,,,,,,,,,,,,,0,1,Maison,120,6,S,sols,,,360,0.2489,47.555146
2020-539860,2020-10-15,000001,Vente,75500,,,LE BOURG,B012,37330,37036,Braye-sur-Maulne,37,,,370360000A0446,,,,,,,,,,,,,0,,,,,J,jardins,POTAG,Jardin potager,200,0.248025,47.555099
2020-539860,2020-10-15,000001,Vente,75500,,,LE BOURG,B012,37330,37036,Braye-sur-Maulne,37,,,370360000A0857,,,,,,,,,,,,,0,,,,,S,sols,,,40,0.248891,47.555205
2020-540285,2020-10-30,000002,Vente,195000,,,LA BABINIERE,B003,37330,37036,Braye-sur-Maulne,37,,,370360000A0018,,,,,,,,,,,,,0,,,,,J,jardins,POTAG,Jardin potager,725,0.237827,47.564458
2020-540285,2020-10-30,000002,Vente,195000,,,LA BABINIERE,B003,37330,37036,Braye-sur-Maulne,37,,,370360000A0019,,,,,,,,,,,,,0,,,,,P,prés,,,3430,0.238229,47.564725
2020-540285,2020-10-30,000002,Vente,195000,,,LA BABINIERE,B003,37330,37036,Braye-sur-Maulne,37,,,370360000A0019,,,,,,,,,,,,,0,,,,,S,sols,,,1530,0.238229,47.564725
2020-540285,2020-10-30,000002,Vente,195000,,,LA BABINIERE,B003,37330,37036,Braye-sur-Maulne,37,,,370360000A0022,,,,,,,,,,,,,0,,,,,P,prés,,,1480,0.240273,47.564304
2020-540285,2020-10-30,000002,Vente,195000,,,LA BABINIERE,B003,37330,37036,Braye-sur-Maulne,37,,,370360000A0023,,,,,,,,,,,,,0,,,,,P,prés,,,5160,0.239907,47.564277
2020-540285,2020-10-30,000002,Vente,195000,,,LA JARDERIE,B048,37330,37036,Braye-sur-Maulne,37,,,370360000A0030,,,,,,,,,,,,,0,,,,,P,prés,,,4800,0.240713,47.5645
2020-540285,2020-10-30,000002,Vente,195000,2,,LA BABINIERE,B003,37330,37036,Braye-sur-Maulne,37,,,370360000A1069,,,,,,,,,,,,,0,1,Maison,160,5,S,sols,,,2106,0.238447,47.565228
2020-540670,2020-12-14,000001,Vente,90000,,,LE BOURG,B012,37330,37036,Braye-sur-Maulne,37,,,370360000A0449,,,,,,,,,,,,,0,,,,,T,terres,,,3985,0.247632,47.555376
2020-540670,2020-12-14,000001,Vente,90000,65,,LE BOURG,B012,37330,37036,Braye-sur-Maulne,37,,,370360000A0455,,,,,,,,,,,,,0,1,Maison,75,4,S,sols,,,920,0.248074,47.555816
2020-540670,2020-12-14,000001,Vente,90000,65,,LE BOURG,B012,37330,37036,Braye-sur-Maulne,37,,,370360000A0455,,,,,,,,,,,,,0,1,Maison,21,1,S,sols,,,920,0.248074,47.555816
2020-540670,2020-12-14,000001,Vente,90000,,,LE BOURG,B012,37330,37036,Braye-sur-Maulne,37,,,370360000A0456,,,,,,,,,,,,,0,,,,,J,jardins,POTAG,Jardin potager,1175,0.24734,47.555682
2020-540676,2020-12-11,000001,Vente,125430,74,,LE BOURG,B012,37330,37036,Braye-sur-Maulne,37,,,370360000A0432,,,,,,,,,,,,,0,1,Maison,123,5,S,sols,,,529,0.249128,47.554921
2020-540676,2020-12-11,000001,Vente,125430,,,LE BOURG,B012,37330,37036,Braye-sur-Maulne,37,,,370360000A0434,,,,,,,,,,,,,0,,,,,J,jardins,POTAG,Jardin potager,718,0.249232,47.554571
2020-540676,2020-12-11,000001,Vente,125430,,,LE BOURG,B012,37330,37036,Braye-sur-Maulne,37,,,370360000A0434,,,,,,,,,,,,,0,,,,,S,sols,,,732,0.249232,47.554571
2020-540676,2020-12-11,000001,Vente,125430,,,LE BOURG,B012,37330,37036,Braye-sur-Maulne,37,,,370360000A0883,,,,,,,,,,,,,0,,,,,T,terres,,,1380,0.249678,47.5545
