id_mutation,date_mutation,numero_disposition,nature_mutation,valeur_fonciere,adresse_numero,adresse_suffixe,adresse_nom_voie,adresse_code_voie,code_postal,code_commune,nom_commune,code_departement,ancien_code_commune,ancien_nom_commune,id_parcelle,ancien_id_parcelle,numero_volume,lot1_numero,lot1_surface_carrez,lot2_numero,lot2_surface_carrez,lot3_numero,lot3_surface_carrez,lot4_numero,lot4_surface_carrez,lot5_numero,lot5_surface_carrez,nombre_lots,code_type_local,type_local,surface_reelle_bati,nombre_pieces_principales,code_nature_culture,nature_culture,code_nature_culture_speciale,nature_culture_speciale,surface_terrain,longitude,latitude
2020-541023,2020-01-09,000001,Vente,65000,,,LA TAILLE MARAIS,B182,37500,37126,Lerné,37,,,371260000D0440,,,,,,,,,,,,,0,,,,,BT,taillis simples,,,2456,0.120064,47.144375
2020-541023,2020-01-09,000001,Vente,65000,,,LA ROCHE THIBAULT,B172,37500,37126,Lerné,37,,,37126000ZD0144,,,,,,,,,,,,,0,,,,,T,terres,,,1282,0.11503,47.137261
2020-541023,2020-01-09,000001,Vente,65000,,,LES CHAMPS DENIAUX,B041,37500,37126,Lerné,37,,,37126000ZD0173,,,,,,,,,,,,,0,,,,,BT,taillis simples,,,380,0.114749,47.141611
2020-541023,2020-01-09,000001,Vente,65000,,,LES CHAMPS DENIAUX,B041,37500,37126,Lerné,37,,,37126000ZD0175,,,,,,,,,,,,,0,,,,,BT,taillis simples,,,391,0.115144,47.141607
2020-541023,2020-01-09,000001,Vente,65000,,,LES CHAMPS DENIAUX,B041,37500,37126,Lerné,37,,,37126000ZD0177,,,,,,,,,,,,,0,,,,,BT,taillis simples,,,224,0.115323,47.141578
2020-541023,2020-01-09,000001,Vente,65000,121,,LA ROCHE THIBAULT,B172,37500,37126,Lerné,37,,,37126000ZD0230,,,,,,,,,,,,,0,1,Maison,113,3,S,sols,,,607,0.114985,47.137484
2020-541023,2020-01-09,000001,Vente,65000,,,LA ROCHE THIBAULT,B172,37500,37126,Lerné,37,,,37126000ZD0231,,,,,,,,,,,,,0,,,,,S,sols,,,50,0.115143,47.137549
2020-541023,2020-01-09,000001,Vente,65000,,,LA ROCHE THIBAULT,B172,37500,37126,Lerné,37,,,37126000ZD0232,,,,,,,,,,,,,0,,,,,T,terres,,,192,0.114978,47.137645
2020-541197,2020-01-22,000001,Vente,110000,6,,RUE DU PORTAIL BLANC,0156,37500,37126,Lerné,37,,,37126000AB0516,,,,,,,,,,,,,0,1,Maison,100,4,S,sols,,,521,0.121419,47.134973
2020-541197,2020-01-22,000001,Vente,110000,,,LE BOURG,B026,37500,37126,Lerné,37,,,37126000AB0517,,,,,,,,,,,,,0,,,,,S,sols,,,49,0.121633,47.135034
2020-541373,2020-02-25,000001,Vente,4000,,,PIECE DES CHILLOLETS,B136,37500,37126,Lerné,37,,,37126000ZA0070,,,,,,,,,,,,,0,,,,,T,terres,,,1511,0.09449,47.122273
2020-541373,2020-02-25,000001,Vente,4000,,,LA BATARDIERE,B007,37500,37126,Lerné,37,,,37126000ZC0023,,,,,,,,,,,,,0,,,,,T,terres,,,3856,0.098186,47.128113
2020-541432,2020-02-26,000001,Vente,1500,,,LA MALIGRATTE,B121,37500,37126,Lerné,37,,,37126000ZD0083,,,,,,,,,,,,,0,,,,,T,terres,,,1000,0.122475,47.140722
2020-541432,2020-02-26,000001,Vente,1500,,,LA MALIGRATTE,B121,37500,37126,Lerné,37,,,37126000ZD0084,,,,,,,,,,,,,0,,,,,T,terres,,,2268,0.122877,47.140747
2020-541624,2020-05-14,000001,Vente,500,,,LES CHAMPS DENIAUX,B041,37500,37126,Lerné,37,,,37126000ZD0170,,,,,,,,,,,,,0,,,,,BT,taillis simples,,,990,0.113914,47.141714
2020-541916,2020-06-12,000001,Vente,67877,,,LES QUARANTE BOISSELEES,B164,37500,37126,Lerné,37,,,37126000ZB0072,,,,,,,,,,,,,0,,,,,T,terres,,,17066,0.100753,47.13363
2020-541916,2020-06-12,000001,Vente,67877,,,LES QUARANTE BOISSELEES,B164,37500,37126,Lerné,37,,,37126000ZB0161,,,,,,,,,,,,,0,,,,,T,terres,,,24330,0.103085,47.134087
2020-541916,2020-06-12,000001,Vente,67877,,,LES MAURICIERES,B124,37500,37126,Lerné,37,,,37126000ZC0017,,,,,,,,,,,,,0,,,,,T,terres,,,26481,0.10663,47.129727
2020-541918,2020-06-12,000001,Vente,,,,LES CLOS MOQUETS,B057,37500,37126,Lerné,37,,,37126000ZH0077,,,,,,,,,,,,,0,,,,,T,terres,,,1450,0.133937,47.121651
2020-541918,2020-06-12,000001,Vente,,,,LES CLOS MOQUETS,B057,37500,37126,Lerné,37,,,37126000ZH0083,,,,,,,,,,,,,0,,,,,BR,futaies résineuses,,,4810,0.134699,47.121535
2020-541918,2020-06-12,000002,Vente,,,,PIECE DU PORTAIL BLANC,B141,37500,37126,Lerné,37,,,37126000ZE0002,,,,,,,,,,,,,0,,,,,T,terres,,,32370,0.120902,47.130842
2020-541918,2020-06-12,000002,Vente,,,,PIECE DU PORTAIL BLANC,B141,37500,37126,Lerné,37,,,37126000ZE0002,,,,,,,,,,,,,0,,,,,T,terres,,,10791,0.120902,47.130842
2020-541918,2020-06-12,000002,Vente,,,,LE CLOS BACHET,B052,37500,37126,Lerné,37,,,37126000ZE0046,,,,,,,,,,,,,0,,,,,T,terres,,,11683,0.122783,47.129982
2020-541918,2020-06-12,000002,Vente,,,,LE CLOS BACHET,B052,37500,37126,Lerné,37,,,37126000ZE0046,,,,,,,,,,,,,0,,,,,T,terres,,,3894,0.122783,47.129982
2020-541918,2020-06-12,000002,Vente,,,,LES CLOS MOQUETS,B057,37500,37126,Lerné,37,,,37126000ZH0041,,,,,,,,,,,,,0,,,,,T,terres,,,19142,0.135718,47.122146
2020-542127,2020-07-09,000001,Vente,7027,,,LES EPINETTES,B075,37500,37126,Lerné,37,,,371260000D0398,,,,,,,,,,,,,0,,,,,BT,taillis simples,,,20286,0.12965,47.147997
2020-542127,2020-07-09,000001,Vente,7027,,,LES EPINETTES,B075,37500,37126,Lerné,37,,,371260000D0399,,,,,,,,,,,,,0,,,,,BT,taillis simples,,,14848,0.129203,47.147091
2020-542137,2020-07-20,000001,Vente,70500,174,,LA HAYE,B110,37500,37126,Lerné,37,,,37126000ZC0059,,,,,,,,,,,,,0,1,Maison,80,2,S,sols,,,2320,0.103577,47.123023
2020-542137,2020-07-20,000001,Vente,70500,174,,LA HAYE,B110,37500,37126,Lerné,37,,,37126000ZC0059,,,,,,,,,,,,,0,1,Maison,20,1,S,sols,,,2320,0.103577,47.123023
2020-542137,2020-07-20,000001,Vente,70500,,,LA HAYE,B110,37500,37126,Lerné,37,,,37126000ZC0073,,,,,,,,,,,,,0,,,,,T,terres,,,204,0.103897,47.123286
2020-542386,2020-09-01,000001,Vente,6929,,,LE BOURG,B026,37500,37126,Lerné,37,,,37126000AB0521,,,,,,,,,,,,,0,,,,,T,terres,,,2788,0.118097,47.134809
2020-542386,2020-09-01,000001,Vente,6929,,,LE PORTAIL BLANC,B157,37500,37126,Lerné,37,,,37126000ZD0013,,,,,,,,,,,,,0,,,,,T,terres,,,5364,0.118302,47.134419
2020-542669,2020-09-29,000001,Vente,50000,,,LA GRANDE CHEMINEE,B094,37500,37126,Lerné,37,,,37126000ZC0002,,,,,,,,,,,,,0,,,,,T,terres,,,5207,0.095007,47.128998
2020-542669,2020-09-29,000001,Vente,50000,,,LA GRANDE CHEMINEE,B094,37500,37126,Lerné,37,,,37126000ZC0063,,,,,,,,,,,,,0,,,,,S,sols,,,1159,0.094936,47.128938
2020-542669,2020-09-29,000001,Vente,50000,,,LA GRANDE CHEMINEE,B094,37500,37126,Lerné,37,,,37126000ZC0064,,,,,,,,,,,,,0,,,,,T,terres,,,650,0.09461,47.129035
2020-542669,2020-09-29,000001,Vente,50000,165,B,LA GRANDE CHEMINEE,B094,37500,37126,Lerné,37,,,37126000ZC0065,,,8,,,,,,,,,,1,3,Dépendance,,0,,,,,,0.094523,47.129085
2020-542669,2020-09-29,000001,Vente,50000,165,B,LA GRANDE CHEMINEE,B094,37500,37126,Lerné,37,,,37126000ZC0065,,,6,,,,,,,,,,1,3,Dépendance,,0,,,,,,0.094523,47.129085
2020-542669,2020-09-29,000001,Vente,50000,165,B,LA GRANDE CHEMINEE,B094,37500,37126,Lerné,37,,,37126000ZC0065,,,7,,,,,,,,,,1,3,Dépendance,,0,,,,,,0.094523,47.129085
2020-542669,2020-09-29,000001,Vente,50000,165,B,LA GRANDE CHEMINEE,B094,37500,37126,Lerné,37,,,37126000ZC0065,,,4,,,,,,,,,,1,3,Dépendance,,0,,,,,,0.094523,47.129085
2020-542669,2020-09-29,000001,Vente,50000,165,B,LA GRANDE CHEMINEE,B094,37500,37126,Lerné,37,,,37126000ZC0065,,,3,,,,,,,,,,1,3,Dépendance,,0,,,,,,0.094523,47.129085
2020-542669,2020-09-29,000001,Vente,50000,165,B,LA GRANDE CHEMINEE,B094,37500,37126,Lerné,37,,,37126000ZC0065,,,2,,,,,,,,,,1,3,Dépendance,,0,,,,,,0.094523,47.129085
2020-542840,2020-10-09,000001,Vente,20000,,,LA RUE,B175,37500,37126,Lerné,37,,,371260000D1164,,,,,,,,,,,,,0,,,,,AB,terrains a bâtir,,,2036,0.135773,47.136263
2020-542882,2020-10-20,000001,Vente,7309.6,,,PIECE DES EBERNES,B137,37500,37126,Lerné,37,,,37126000ZA0097,,,,,,,,,,,,,0,,,,,T,terres,,,9137,0.085889,47.120463
2020-542882,2020-10-20,000001,Vente,7309.6,,,PIECE DES EBERNES,B137,37500,37126,Lerné,37,,,37126000ZA0097,,,,,,,,,,,,,0,,,,,T,terres,,,9137,0.085889,47.120463
2020-543146,2020-11-24,000001,Vente,140400,26,,RUE DES FOUACIERS,0057,37500,37126,Lerné,37,,,37126000AB0140,,,,,,,,,,,,,0,1,Maison,80,3,S,sols,,,55,0.122457,47.135203
2020-543146,2020-11-24,000001,Vente,140400,22,,RUE DES FOUACIERS,0057,37500,37126,Lerné,37,,,37126000AB0142,,,1,,2,,3,,,,,,3,1,Maison,64,3,,,,,,0.122662,47.135204
2020-543146,2020-11-24,000001,Vente,140400,22,,RUE DES FOUACIERS,0057,37500,37126,Lerné,37,,,37126000AB0142,,,1,,2,,3,,,,,,3,1,Maison,68,4,,,,,,0.122662,47.135204
2020-543146,2020-11-24,000001,Vente,140400,,,LE BOURG,B026,37500,37126,Lerné,37,,,37126000AB0143,,,,,,,,,,,,,0,,,,,S,sols,,,6,0.122675,47.13517
2020-543146,2020-11-24,000001,Vente,140400,68,,LE BOURG,B026,37500,37126,Lerné,37,,,37126000AB0145,,,,,,,,,,,,,0,3,Dépendance,,0,S,sols,,,19,0.122438,47.135094
2020-543146,2020-11-24,000001,Vente,140400,,,LE BOURG,B026,37500,37126,Lerné,37,,,37126000AB0146,,,,,,,,,,,,,0,,,,,S,sols,,,26,0.122432,47.135049
2020-543146,2020-11-24,000001,Vente,140400,,,LE BOURG,B026,37500,37126,Lerné,37,,,37126000AB0149,,,,,,,,,,,,,0,,,,,S,sols,,,68,0.122723,47.135063
2020-543146,2020-11-24,000001,Vente,140400,24,,RUE DES FOUACIERS,0057,37500,37126,Lerné,37,,,37126000AB0310,,,,,,,,,,,,,0,1,Maison,76,3,S,sols,,,51,0.122523,47.135207
2020-543146,2020-11-24,000001,Vente,140400,,,LE BOURG,B026,37500,37126,Lerné,37,,,37126000AB0311,,,,,,,,,,,,,0,,,,,S,sols,,,6,0.122509,47.135229
2020-543146,2020-11-24,000001,Vente,140400,,,LE BOURG,B026,37500,37126,Lerné,37,,,37126000AB0312,,,,,,,,,,,,,0,,,,,S,sols,,,2,0.122504,47.135238
2020-543146,2020-11-24,000001,Vente,140400,,,LE BOURG,B026,37500,37126,Lerné,37,,,37126000AB0399,,,,,,,,,,,,,0,,,,,S,sols,,,206,0.122502,47.134941
2020-543146,2020-11-24,000001,Vente,140400,,,LE BOURG,B026,37500,37126,Lerné,37,,,37126000AB0401,,,,,,,,,,,,,0,,,,,S,sols,,,30,0.122437,47.135141
2020-543146,2020-11-24,000001,Vente,140400,,,LE BOURG,B026,37500,37126,Lerné,37,,,37126000AB0403,,,,,,,,,,,,,0,,,,,S,sols,,,71,0.12251,47.135081
2020-543146,2020-11-24,000001,Vente,140400,,,LE BOURG,B026,37500,37126,Lerné,37,,,37126000AB0404,,,,,,,,,,,,,0,,,,,S,sols,,,130,0.122686,47.13515
2020-543146,2020-11-24,000001,Vente,140400,,,LE BOURG,B026,37500,37126,Lerné,37,,,37126000AB0513,,,,,,,,,,,,,0,,,,,S,sols,,,236,0.122681,47.135027
2020-543147,2020-11-24,000002,Vente,150,22,,RUE DES FOUACIERS,0057,37500,37126,Lerné,37,,,37126000AB0142,,,1,,2,,3,,,,,,3,1,Maison,64,3,,,,,,0.122662,47.135204
2020-543147,2020-11-24,000002,Vente,150,22,,RUE DES FOUACIERS,0057,37500,37126,Lerné,37,,,37126000AB0142,,,1,,2,,3,,,,,,3,1,Maison,68,4,,,,,,0.122662,47.135204
2020-543147,2020-11-24,000002,Vente,150,,,LE BOURG,B026,37500,37126,Lerné,37,,,37126000AB0149,,,,,,,,,,,,,0,,,,,S,sols,,,68,0.122723,47.135063
2020-543266,2020-12-22,000001,Vente,102000,2,,RUE DE LA GRAND'COUR,0067,37500,37126,Lerné,37,,,37126000AB0050,,,,,,,,,,,,,0,1,Maison,70,3,S,sols,,,213,0.123389,47.136468
2020-543266,2020-12-22,000001,Vente,102000,2,,RUE DE LA GRAND'COUR,0067,37500,37126,Lerné,37,,,37126000AB0050,,,,,,,,,,,,,0,3,Dépendance,,0,S,sols,,,213,0.123389,47.136468
2020-543266,2020-12-22,000001,Vente,102000,,,LA GRAND COUR,B092,37500,37126,Lerné,37,,,37126000AB0053,,,,,,,,,,,,,0,,,,,T,terres,,,194,0.123674,47.136503
2020-543266,2020-12-22,000001,Vente,102000,192,,LA GRAND COUR,B092,37500,37126,Lerné,37,,,37126000AB0054,,,1,,,,,,,,,,1,3,Dépendance,,0,,,,,,0.123726,47.136547
2020-543266,2020-12-22,000001,Vente,102000,189,E,LA GRAND COUR,B092,37500,37126,Lerné,37,,,37126000AB0308,,,7,,,,,,,,,,1,3,Dépendance,,0,,,,,,0.123271,47.136507
2020-543266,2020-12-22,000001,Vente,102000,189,G,LA GRAND COUR,B092,37500,37126,Lerné,37,,,37126000AB0308,,,5,,,,,,,,,,1,3,Dépendance,,0,,,,,,0.123271,47.136507
2020-543266,2020-12-22,000001,Vente,102000,189,D,LA GRAND COUR,B092,37500,37126,Lerné,37,,,37126000AB0308,,,6,,,,,,,,,,1,3,Dépendance,,0,,,,,,0.123271,47.136507
2020-543266,2020-12-22,000001,Vente,102000,,,LA GRAND COUR,B092,37500,37126,Lerné,37,,,37126000AB0309,,,,,,,,,,,,,0,,,,,S,sols,,,4,0.12333,47.136498
2020-543266,2020-12-22,000001,Vente,102000,,,LA GRAND COUR,B092,37500,37126,Lerné,37,,,37126000AB0332,,,,,,,,,,,,,0,,,,,T,terres,,,1080,0.123373,47.136605
