id_mutation,date_mutation,numero_disposition,nature_mutation,valeur_fonciere,adresse_numero,adresse_suffixe,adresse_nom_voie,adresse_code_voie,code_postal,code_commune,nom_commune,code_departement,ancien_code_commune,ancien_nom_commune,id_parcelle,ancien_id_parcelle,numero_volume,lot1_numero,lot1_surface_carrez,lot2_numero,lot2_surface_carrez,lot3_numero,lot3_surface_carrez,lot4_numero,lot4_surface_carrez,lot5_numero,lot5_surface_carrez,nombre_lots,code_type_local,type_local,surface_reelle_bati,nombre_pieces_principales,code_nature_culture,nature_culture,code_nature_culture_speciale,nature_culture_speciale,surface_terrain,longitude,latitude
2020-541193,2020-02-14,000001,Vente,1500,,,LA FOSSE DES TRANCHEES,B071,37120,37148,Marigny-Marmande,37,,,371480000D0039,,,,,,,,,,,,,0,,,,,BT,taillis simples,,,4934,0.462416,46.985288
2020-541506,2020-03-19,000001,Vente,234000,10,,LES BOUGREAUX,X004,37120,37148,Marigny-Marmande,37,,,37148000ZC0052,,,,,,,,,,,,,0,1,Maison,184,6,S,sols,,,1000,0.510755,47.008779
2020-541506,2020-03-19,000001,Vente,234000,10,,LES BOUGREAUX,X004,37120,37148,Marigny-Marmande,37,,,37148000ZC0052,,,,,,,,,,,,,0,1,Maison,184,6,J,jardins,POTAG,Jardin potager,2102,0.510755,47.008779
2020-541658,2020-05-22,000001,Vente,90000,19,,GR GRANDE RUE,0040,37120,37148,Marigny-Marmande,37,,,371480000C1229,,,,,,,,,,,,,0,1,Maison,160,4,S,sols,,,537,0.4891,46.98062
2020-541663,2020-05-25,000001,Vente,400000,,,LES AJONCS,B002,37120,37148,Marigny-Marmande,37,,,37148000YC0004,,,,,,,,,,,,,0,,,,,J,jardins,POTAG,Jardin potager,2867,0.465359,46.98572
2020-541663,2020-05-25,000001,Vente,400000,71,,LES AJONCS,B002,37120,37148,Marigny-Marmande,37,,,37148000YC0006,,,,,,,,,,,,,0,1,Maison,130,4,T,terres,,,2070,0.46589,46.985261
2020-541663,2020-05-25,000001,Vente,400000,71,,LES AJONCS,B002,37120,37148,Marigny-Marmande,37,,,37148000YC0006,,,,,,,,,,,,,0,1,Maison,40,2,BT,taillis simples,,,2070,0.46589,46.985261
2020-541663,2020-05-25,000001,Vente,400000,71,,LES AJONCS,B002,37120,37148,Marigny-Marmande,37,,,37148000YC0006,,,,,,,,,,,,,0,1,Maison,130,4,BT,taillis simples,,,2070,0.46589,46.985261
2020-541663,2020-05-25,000001,Vente,400000,71,,LES AJONCS,B002,37120,37148,Marigny-Marmande,37,,,37148000YC0006,,,,,,,,,,,,,0,1,Maison,40,2,T,terres,,,2070,0.46589,46.985261
2020-541663,2020-05-25,000001,Vente,400000,71,,LES AJONCS,B002,37120,37148,Marigny-Marmande,37,,,37148000YC0006,,,,,,,,,,,,,0,1,Maison,130,4,S,sols,,,2188,0.46589,46.985261
2020-541663,2020-05-25,000001,Vente,400000,71,,LES AJONCS,B002,37120,37148,Marigny-Marmande,37,,,37148000YC0006,,,,,,,,,,,,,0,1,Maison,40,2,S,sols,,,2188,0.46589,46.985261
2020-541776,2020-06-08,000001,Vente,35000,205,,LE BOURG,B030,37120,37148,Marigny-Marmande,37,,,371480000C0582,,,,,,,,,,,,,0,4,Local industriel. commercial ou assimilé,196,0,S,sols,,,515,0.486389,46.982444
2020-541803,2020-06-11,000001,Vente,60000,,,LES BRUNS,B034,37120,37148,Marigny-Marmande,37,,,37148000ZS0003,,,,,,,,,,,,,0,,,,,T,terres,,,1996,0.455827,46.950426
2020-541803,2020-06-11,000001,Vente,60000,,,LES BRUNS,B034,37120,37148,Marigny-Marmande,37,,,37148000ZS0003,,,,,,,,,,,,,0,,,,,VI,vignes,,,860,0.455827,46.950426
2020-541803,2020-06-11,000001,Vente,60000,,,LES JOUBERTS,B100,37120,37148,Marigny-Marmande,37,,,37148000ZT0026,,,,,,,,,,,,,0,,,,,T,terres,,,10840,0.446841,46.951645
2020-541803,2020-06-11,000001,Vente,60000,,,LES JOUBERTS,B100,37120,37148,Marigny-Marmande,37,,,37148000ZT0045,,,,,,,,,,,,,0,,,,,T,terres,,,31526,0.448364,46.951245
2020-541803,2020-06-11,000001,Vente,60000,,,LES JOUBERTS,B100,37120,37148,Marigny-Marmande,37,,,37148000ZT0045,,,,,,,,,,,,,0,,,,,T,terres,,,31526,0.448364,46.951245
2020-542297,2020-08-25,000001,Vente,22960,,,LA MAITRIE,B108,37120,37148,Marigny-Marmande,37,,,37148000ZT0029,,,,,,,,,,,,,0,,,,,S,sols,,,3713,0.452179,46.942056
2020-542313,2020-09-01,000001,Vente,72000,1,,LES PIMBERTS,X017,37120,37148,Marigny-Marmande,37,,,37148000YE0038,,,,,,,,,,,,,0,1,Maison,59,2,S,sols,,,744,0.475981,46.993041
2020-542361,2020-08-31,000001,Vente,32000,,,LES TOUCHES,B177,37120,37148,Marigny-Marmande,37,,,37148000YD0045,,,,,,,,,,,,,0,,,,,T,terres,,,4789,0.492546,46.98747
2020-542361,2020-08-31,000001,Vente,32000,,,LES TOUCHES,B177,37120,37148,Marigny-Marmande,37,,,37148000YD0045,,,,,,,,,,,,,0,,,,,T,terres,,,9579,0.492546,46.98747
2020-542361,2020-08-31,000001,Vente,32000,,,LES TOUCHES,B177,37120,37148,Marigny-Marmande,37,,,37148000YD0045,,,,,,,,,,,,,0,,,,,T,terres,,,4789,0.492546,46.98747
2020-542361,2020-08-31,000001,Vente,32000,,,LES TOUCHES,B177,37120,37148,Marigny-Marmande,37,,,37148000YD0047,,,,,,,,,,,,,0,,,,,T,terres,,,19645,0.494005,46.988786
2020-542361,2020-08-31,000001,Vente,32000,,,LE BARNABE,B005,37120,37148,Marigny-Marmande,37,,,37148000YD0120,,,,,,,,,,,,,0,,,,,T,terres,,,9540,0.494869,46.990028
2020-542361,2020-08-31,000001,Vente,32000,,,LE BARNABE,B005,37120,37148,Marigny-Marmande,37,,,37148000YD0120,,,,,,,,,,,,,0,,,,,BT,taillis simples,,,460,0.494869,46.990028
2020-542480,2020-09-18,000001,Vente,120000,,,LES CHAUMES,B042,37120,37148,Marigny-Marmande,37,,,37148000YH0020,,,,,,,,,,,,,0,,,,,BT,taillis simples,,,3618,0.461119,46.953538
2020-542480,2020-09-18,000001,Vente,120000,,,LES CHAUMES,B042,37120,37148,Marigny-Marmande,37,,,37148000YH0021,,,,,,,,,,,,,0,,,,,BT,taillis simples,,,3301,0.460912,46.953718
2020-542480,2020-09-18,000001,Vente,120000,,,LES CHAUMES,B042,37120,37148,Marigny-Marmande,37,,,37148000YH0022,,,,,,,,,,,,,0,,,,,T,terres,,,7109,0.460821,46.95409
2020-542480,2020-09-18,000001,Vente,120000,282,,LES CHAUMES,B042,37120,37148,Marigny-Marmande,37,,,37148000YH0025,,,,,,,,,,,,,0,1,Maison,100,3,S,sols,,,2494,0.46139,46.954811
2020-542480,2020-09-18,000001,Vente,120000,,,LES CHAUMES,B042,37120,37148,Marigny-Marmande,37,,,37148000YH0028,,,,,,,,,,,,,0,,,,,BF,futaies feuillues,,,1649,0.461595,46.954545
2020-542554,2020-10-01,000001,Vente,82094,94,,LE BARON,B006,37120,37148,Marigny-Marmande,37,,,37148000YC0123,,,,,,,,,,,,,0,1,Maison,42,1,S,sols,,,765,0.479318,46.987665
2020-542554,2020-10-01,000001,Vente,82094,94,,LE BARON,B006,37120,37148,Marigny-Marmande,37,,,37148000YC0123,,,,,,,,,,,,,0,1,Maison,42,1,T,terres,,,2148,0.479318,46.987665
2020-542558,2020-09-25,000001,Vente,700,,,LES POIRILLONS,B155,37120,37148,Marigny-Marmande,37,,,37148000YE0045,,,,,,,,,,,,,0,,,,,T,terres,,,4523,0.4751,46.99653
2020-542610,2020-10-06,000001,Vente,600,5144,,RUE DE L EGLISE,0030,37120,37148,Marigny-Marmande,37,,,371480000C0451,,,,,,,,,,,,,0,3,Dépendance,,0,S,sols,,,44,0.489993,46.981398
2020-542782,2020-10-16,000001,Vente,280440,,,LA BOISSIERE,B026,37120,37148,Marigny-Marmande,37,,,37148000ZH0020,,,,,,,,,,,,,0,,,,,T,terres,,,1027,0.496563,46.994926
2020-542782,2020-10-16,000001,Vente,280440,43,,LA BOISSIERE,B026,37120,37148,Marigny-Marmande,37,,,37148000ZH0021,,,,,,,,,,,,,0,1,Maison,148,4,BT,taillis simples,,,8455,0.497534,46.994187
2020-542782,2020-10-16,000001,Vente,280440,43,,LA BOISSIERE,B026,37120,37148,Marigny-Marmande,37,,,37148000ZH0021,,,,,,,,,,,,,0,1,Maison,148,4,S,sols,,,600,0.497534,46.994187
2020-542782,2020-10-16,000001,Vente,280440,43,,LA BOISSIERE,B026,37120,37148,Marigny-Marmande,37,,,37148000ZH0021,,,,,,,,,,,,,0,1,Maison,148,4,T,terres,,,8454,0.497534,46.994187
2020-542782,2020-10-16,000001,Vente,280440,43,B,LA BOISSIERE,B026,37120,37148,Marigny-Marmande,37,,,37148000ZH0022,,,,,,,,,,,,,0,1,Maison,130,3,S,sols,,,500,0.498452,46.994316
2020-542782,2020-10-16,000001,Vente,280440,43,B,LA BOISSIERE,B026,37120,37148,Marigny-Marmande,37,,,37148000ZH0022,,,,,,,,,,,,,0,1,Maison,130,3,T,terres,,,2358,0.498452,46.994316
2020-542782,2020-10-16,000001,Vente,280440,,,LA BOISSIERE,B026,37120,37148,Marigny-Marmande,37,,,37148000ZH0023,,,,,,,,,,,,,0,,,,,S,sols,,,1191,0.4988,46.994332
2020-542782,2020-10-16,000001,Vente,280440,,,LA BOISSIERE,B026,37120,37148,Marigny-Marmande,37,,,37148000ZH0040,,,,,,,,,,,,,0,,,,,T,terres,,,737,0.498894,46.994159
2020-543040,2020-11-20,000001,Vente,18000,,,LES DELAROCHES,B063,37120,37148,Marigny-Marmande,37,,,37148000YD0051,,,,,,,,,,,,,0,,,,,T,terres,,,500,0.493362,46.986571
2020-543040,2020-11-20,000001,Vente,18000,5,,LES DELAROCHES,X006,37120,37148,Marigny-Marmande,37,,,37148000YD0126,,,,,,,,,,,,,0,1,Maison,51,2,S,sols,,,247,0.492388,46.986153
2020-543287,2020-12-29,000001,Vente,90000,1,,RUE DE LUZE,0057,37120,37148,Marigny-Marmande,37,,,371480000C0592,,,,,,,,,,,,,0,1,Maison,83,3,S,sols,,,419,0.487647,46.983052
2020-543289,2020-12-22,000001,Vente,20500,,,LE BOURG,B030,37120,37148,Marigny-Marmande,37,,,371480000C0505,,,,,,,,,,,,,0,,,,,S,sols,,,312,0.488504,46.979659
2020-543289,2020-12-22,000001,Vente,20500,,,LE BOURG,B030,37120,37148,Marigny-Marmande,37,,,371480000C0507,,,,,,,,,,,,,0,,,,,J,jardins,POTAG,Jardin potager,498,0.488544,46.979602
2020-543289,2020-12-22,000001,Vente,20500,,,LE BOURG,B030,37120,37148,Marigny-Marmande,37,,,371480000C0508,,,,,,,,,,,,,0,,,,,S,sols,,,15,0.488463,46.97971
2020-543289,2020-12-22,000001,Vente,20500,6,,IMP DE LA POSTE,0098,37120,37148,Marigny-Marmande,37,,,371480000C0509,,,,,,,,,,,,,0,1,Maison,92,4,S,sols,,,462,0.488217,46.979685
2020-543289,2020-12-22,000001,Vente,20500,5196,,RUE DE LA POSTE,0099,37120,37148,Marigny-Marmande,37,,,371480000C0510,,,,,,,,,,,,,0,3,Dépendance,,0,S,sols,,,21,0.488135,46.979735
