id_mutation,date_mutation,numero_disposition,nature_mutation,valeur_fonciere,adresse_numero,adresse_suffixe,adresse_nom_voie,adresse_code_voie,code_postal,code_commune,nom_commune,code_departement,ancien_code_commune,ancien_nom_commune,id_parcelle,ancien_id_parcelle,numero_volume,lot1_numero,lot1_surface_carrez,lot2_numero,lot2_surface_carrez,lot3_numero,lot3_surface_carrez,lot4_numero,lot4_surface_carrez,lot5_numero,lot5_surface_carrez,nombre_lots,code_type_local,type_local,surface_reelle_bati,nombre_pieces_principales,code_nature_culture,nature_culture,code_nature_culture_speciale,nature_culture_speciale,surface_terrain,longitude,latitude
2020-545084,2020-01-13,000001,Vente en l'état futur d'achèvement,220000,,,LES MICHELLIERES,B032,38190,38039,Bernin,38,,,38039000AC0404,,,77,,,,,,,,,,1,2,Appartement,45,2,,,,,,5.867016,45.271493
2020-545084,2020-01-13,000001,Vente en l'état futur d'achèvement,220000,,,LES MICHELLIERES,B032,38190,38039,Bernin,38,,,38039000AC0404,,,26,,,,,,,,,,1,3,Dépendance,,0,,,,,,5.867016,45.271493
2020-545086,2020-01-10,000001,Vente terrain à bâtir,240000,146,,CHE DES RESERVOIRS,0163,38190,38039,Bernin,38,,,38039000AM0548,,,,,,,,,,,,,0,1,Maison,122,5,S,sols,,,462,5.870664,45.270752
2020-545086,2020-01-10,000001,Vente terrain à bâtir,240000,,,LES GRANDES TERRES,B025,38190,38039,Bernin,38,,,38039000AM0568,,,,,,,,,,,,,0,,,,,S,sols,,,201,5.870511,45.270621
2020-545262,2020-01-13,000001,Vente,150000,19,,CHE DU PUITS,0162,38190,38039,Bernin,38,,,38039000AM0229,,,,,,,,,,,,,0,1,Maison,24,1,S,sols,,,83,5.869465,45.269057
2020-545275,2020-01-21,000001,Vente en l'état futur d'achèvement,273000,,,LES MICHELLIERES,B032,38190,38039,Bernin,38,,,38039000AC0404,,,54,,,,,,,,,,1,2,Appartement,62,3,,,,,,5.867016,45.271493
2020-545275,2020-01-21,000001,Vente en l'état futur d'achèvement,273000,,,LES MICHELLIERES,B032,38190,38039,Bernin,38,,,38039000AC0404,,,23,,,,,,,,,,1,3,Dépendance,,0,,,,,,5.867016,45.271493
2020-545278,2020-01-23,000001,Vente,3000,,,LES FONTAINES,B020,38190,38039,Bernin,38,,,38039000AN0179,,,,,,,,,,,,,0,,,,,T,terres,,,1342,5.872542,45.265458
2020-545289,2020-01-20,000001,Vente,236000,,,LES MARECHALES,B031,38190,38039,Bernin,38,,,38039000AM0510,,,,,,,,,,,,,0,,,,,T,terres,,,524,5.869312,45.270708
2020-545361,2020-01-24,000001,Vente,16182,,,CHAMP BERTIN,B008,38190,38039,Bernin,38,,,380390000A0379,,,,,,,,,,,,,0,,,,,BS,taillis sous futaie,,,2739,5.847902,45.273033
2020-545361,2020-01-24,000001,Vente,16182,,,CHAMP BERTIN,B008,38190,38039,Bernin,38,,,380390000A0408,,,,,,,,,,,,,0,,,,,BS,taillis sous futaie,,,2237,5.848604,45.273445
2020-545361,2020-01-24,000001,Vente,16182,,,LES PIGNES,B035,38190,38039,Bernin,38,,,380390000B0638,,,,,,,,,,,,,0,,,,,P,prés,,,3590,5.846775,45.270219
2020-545361,2020-01-24,000001,Vente,16182,,,LES PIGNES,B035,38190,38039,Bernin,38,,,380390000B0639,,,,,,,,,,,,,0,,,,,BT,taillis simples,,,1184,5.846268,45.269936
2020-545361,2020-01-24,000001,Vente,16182,,,LES GRANDES EYMES,B024,38190,38039,Bernin,38,,,380390000B0762,,,,,,,,,,,,,0,,,,,VI,vignes,,,6573,5.847027,45.267351
2020-545361,2020-01-24,000001,Vente,16182,,,LES GRANDES EYMES,B024,38190,38039,Bernin,38,,,380390000B0764,,,,,,,,,,,,,0,,,,,BS,taillis sous futaie,,,3410,5.846168,45.267148
2020-545361,2020-01-24,000001,Vente,16182,,,LES GRANDES EYMES,B024,38190,38039,Bernin,38,,,380390000B0765,,,,,,,,,,,,,0,,,,,BS,taillis sous futaie,,,1420,5.846188,45.267476
2020-545361,2020-01-24,000001,Vente,16182,,,LES GRANDES EYMES,B024,38190,38039,Bernin,38,,,380390000B0770,,,,,,,,,,,,,0,,,,,BS,taillis sous futaie,,,110,5.846959,45.268247
2020-545361,2020-01-24,000001,Vente,16182,,,LES GRANDES EYMES,B024,38190,38039,Bernin,38,,,380390000B0770,,,,,,,,,,,,,0,,,,,VI,vignes,,,1320,5.846959,45.268247
2020-545378,2020-01-23,000001,Vente en l'état futur d'achèvement,215000,,,LES MICHELLIERES,B032,38190,38039,Bernin,38,,,38039000AC0404,,,43,,,,,,,,,,1,2,Appartement,46,2,,,,,,5.867016,45.271493
2020-545378,2020-01-23,000001,Vente en l'état futur d'achèvement,215000,,,LES MICHELLIERES,B032,38190,38039,Bernin,38,,,38039000AC0404,,,24,,,,,,,,,,1,3,Dépendance,,0,,,,,,5.867016,45.271493
2020-545379,2020-01-27,000001,Vente terrain à bâtir,230000,,,LES MARECHALES,B031,38190,38039,Bernin,38,,,38039000AM0592,,,,,,,,,,,,,0,,,,,T,terres,,,87,5.869981,45.271193
2020-545379,2020-01-27,000001,Vente terrain à bâtir,230000,,,LES MARECHALES,B031,38190,38039,Bernin,38,,,38039000AM0598,,,,,,,,,,,,,0,,,,,T,terres,,,471,5.8702,45.271105
2020-545381,2020-01-31,000001,Vente en l'état futur d'achèvement,405000,,,LES GRANDES TERRES,B025,38190,38039,Bernin,38,,,38039000AM0192,,,16,,,,,,,,,,1,2,Appartement,98,5,,,,,,5.869868,45.270533
2020-545381,2020-01-31,000001,Vente en l'état futur d'achèvement,405000,,,LES GRANDES TERRES,B025,38190,38039,Bernin,38,,,38039000AM0192,,,32,,,,,,,,,,1,3,Dépendance,,0,,,,,,5.869868,45.270533
2020-545381,2020-01-31,000001,Vente en l'état futur d'achèvement,405000,,,LES GRANDES TERRES,B025,38190,38039,Bernin,38,,,38039000AM0192,,,33,,,,,,,,,,1,3,Dépendance,,0,,,,,,5.869868,45.270533
2020-545531,2020-02-07,000001,Vente en l'état futur d'achèvement,272000,,,LES MICHELLIERES,B032,38190,38039,Bernin,38,,,38039000AC0404,,,50,,,,,,,,,,1,2,Appartement,64,3,,,,,,5.867016,45.271493
2020-545531,2020-02-07,000001,Vente en l'état futur d'achèvement,272000,,,LES MICHELLIERES,B032,38190,38039,Bernin,38,,,38039000AC0404,,,31,,,,,,,,,,1,3,Dépendance,,0,,,,,,5.867016,45.271493
2020-545658,2020-02-21,000001,Vente,500000,792,,CHE DE LA PROULA,0155,38190,38039,Bernin,38,,,38039000AL0345,,,,,,,,,,,,,0,1,Maison,98,5,S,sols,,,790,5.86571,45.263707
2020-545664,2020-03-02,000001,Vente,230000,,,LES MARECHALES,B031,38190,38039,Bernin,38,,,38039000AC0105,,,,,,,,,,,,,0,,,,,S,sols,,,55,5.868277,45.271545
2020-545664,2020-03-02,000001,Vente,230000,5102,,LES MARECHALES,B031,38190,38039,Bernin,38,,,38039000AC0317,,,,,,,,,,,,,0,2,Appartement,50,3,S,sols,,,69,5.868313,45.27158
2020-545664,2020-03-02,000001,Vente,230000,5102,,LES MARECHALES,B031,38190,38039,Bernin,38,,,38039000AC0317,,,,,,,,,,,,,0,4,Local industriel. commercial ou assimilé,77,0,S,sols,,,69,5.868313,45.27158
2020-545740,2020-02-14,000001,Vente,363000,603,,CHE DE LA PROULA,0155,38190,38039,Bernin,38,,,38039000AL0168,,,5,,,,,,,,,,1,3,Dépendance,,0,,,,,,5.86685,45.265214
2020-545740,2020-02-14,000001,Vente,363000,603,,CHE DE LA PROULA,0155,38190,38039,Bernin,38,,,38039000AL0168,,,2,,,,,,,,,,1,2,Appartement,108,4,,,,,,5.86685,45.265214
2020-545740,2020-02-14,000001,Vente,363000,603,,CHE DE LA PROULA,0155,38190,38039,Bernin,38,,,38039000AL0168,,,4,,,,,,,,,,1,3,Dépendance,,0,,,,,,5.86685,45.265214
2020-545762,2020-02-21,000001,Vente en l'état futur d'achèvement,208000,,,LES MICHELLIERES,B032,38190,38039,Bernin,38,,,38039000AC0404,,,36,,,,,,,,,,1,3,Dépendance,,0,,,,,,5.867016,45.271493
2020-545762,2020-02-21,000001,Vente en l'état futur d'achèvement,208000,,,LES MICHELLIERES,B032,38190,38039,Bernin,38,,,38039000AC0404,,,53,,,,,,,,,,1,2,Appartement,45,2,,,,,,5.867016,45.271493
2020-545901,2020-02-26,000001,Vente en l'état futur d'achèvement,289000,,,LES MICHELLIERES,B032,38190,38039,Bernin,38,,,38039000AC0404,,,25,,,,,,,,,,1,3,Dépendance,,0,,,,,,5.867016,45.271493
2020-545901,2020-02-26,000001,Vente en l'état futur d'achèvement,289000,,,LES MICHELLIERES,B032,38190,38039,Bernin,38,,,38039000AC0404,,,78,,,,,,,,,,1,2,Appartement,66,3,,,,,,5.867016,45.271493
2020-545902,2020-03-09,000001,Vente en l'état futur d'achèvement,273122,,,LES MICHELLIERES,B032,38190,38039,Bernin,38,,,38039000AC0404,,,21,,,,,,,,,,1,3,Dépendance,,0,,,,,,5.867016,45.271493
2020-545902,2020-03-09,000001,Vente en l'état futur d'achèvement,273122,,,LES MICHELLIERES,B032,38190,38039,Bernin,38,,,38039000AC0404,,,82,,,,,,,,,,1,2,Appartement,61,3,,,,,,5.867016,45.271493
2020-545993,2020-03-13,000001,Vente,414000,,,CHE DE CRAPONOZ,0100,38190,38039,Bernin,38,,,38039000AA0033,,,,,,,,,,,,,0,,,,,S,sols,,,3996,5.858486,45.27618
2020-545993,2020-03-13,000001,Vente,414000,5863,,LES COMMUNAUX,B016,38190,38039,Bernin,38,,,38039000AA0040,,,,,,,,,,,,,0,1,Maison,95,5,S,sols,,,829,5.85878,45.276421
2020-545993,2020-03-13,000001,Vente,414000,,,CHE DE CRAPONOZ,0100,38190,38039,Bernin,38,,,38039000AA0043,,,,,,,,,,,,,0,,,,,S,sols,,,32,5.85911,45.277104
2020-545993,2020-03-13,000001,Vente,414000,,,CHE DE CRAPONOZ,0100,38190,38039,Bernin,38,,,38039000AA0044,,,,,,,,,,,,,0,,,,,AG,terrains d'agrément,,,4589,5.85906,45.276353
2020-545997,2020-03-10,000001,Vente,4000,,,LES CLOYERES,B015,38190,38039,Bernin,38,,,38039000AS0049,,,,,,,,,,,,,0,,,,,T,terres,,,2552,5.874651,45.256736
2020-545997,2020-03-10,000001,Vente,4000,,,PRE DU BOEUF,B036,38190,38039,Bernin,38,,,38039000AS0053,,,,,,,,,,,,,0,,,,,T,terres,,,1470,5.874124,45.256436
2020-546001,2020-03-10,000001,Vente,4700,,,LES CLOYERES,B015,38190,38039,Bernin,38,,,38039000AS0049,,,,,,,,,,,,,0,,,,,T,terres,,,2552,5.874651,45.256736
2020-546001,2020-03-10,000001,Vente,4700,,,PRE DU BOEUF,B036,38190,38039,Bernin,38,,,38039000AS0053,,,,,,,,,,,,,0,,,,,T,terres,,,1470,5.874124,45.256436
2020-546086,2020-03-23,000001,Vente terrain à bâtir,225000,,,LES MARECHALES,B031,38190,38039,Bernin,38,,,38039000AM0509,,,,,,,,,,,,,0,,,,,T,terres,,,12,5.870102,45.270874
2020-546086,2020-03-23,000001,Vente terrain à bâtir,225000,,,LES GRANDES TERRES,B025,38190,38039,Bernin,38,,,38039000AM0550,,,,,,,,,,,,,0,,,,,T,terres,,,425,5.870306,45.270903
2020-546086,2020-03-23,000001,Vente terrain à bâtir,225000,,,LES GRANDES TERRES,B025,38190,38039,Bernin,38,,,38039000AM0570,,,,,,,,,,,,,0,,,,,VI,vignes,,,63,5.870173,45.270834
2020-546086,2020-03-23,000001,Vente terrain à bâtir,225000,,,LES MARECHALES,B031,38190,38039,Bernin,38,,,38039000AM0600,,,,,,,,,,,,,0,,,,,T,terres,,,48,5.870201,45.270964
2020-546404,2020-04-27,000001,Vente en l'état futur d'achèvement,215000,,,LES MICHELLIERES,B032,38190,38039,Bernin,38,,,38039000AC0404,,,33,,,,,,,,,,1,3,Dépendance,,0,,,,,,5.867016,45.271493
2020-546404,2020-04-27,000001,Vente en l'état futur d'achèvement,215000,,,LES MICHELLIERES,B032,38190,38039,Bernin,38,,,38039000AC0404,,,49,,,,,,,,,,1,2,Appartement,46,2,,,,,,5.867016,45.271493
2020-546411,2020-04-30,000001,Vente,432500,226,,CHEM DE CHATEAU NARDENT,0092,38190,38039,Bernin,38,,,38039000AH0232,,,26,,,,,,,,,,1,1,Maison,110,5,,,,,,5.85657,45.267643
2020-546411,2020-04-30,000001,Vente,432500,226,,CHEM DE CHATEAU NARDENT,0092,38190,38039,Bernin,38,,,38039000AH0232,,,36,,,,,,,,,,1,3,Dépendance,,0,,,,,,5.85657,45.267643
2020-546452,2020-05-07,000001,Vente,522500,5426,,LA ROUSSE,B040,38190,38039,Bernin,38,,,38039000AD0038,,,,,,,,,,,,,0,1,Maison,146,7,S,sols,,,1259,5.859669,45.268017
2020-546500,2020-03-13,000002,Vente,390000,,,LE VARVOUX,B041,38190,38039,Bernin,38,,,38039000AP0207,,,,,,,,,,,,,0,,,,,S,sols,,,339,5.864217,45.262546
2020-546500,2020-03-13,000002,Vente,390000,,,LE VARVOUX,B041,38190,38039,Bernin,38,,,38039000AP0209,,,,,,,,,,,,,0,,,,,S,sols,,,399,5.864318,45.262724
2020-546500,2020-03-13,000002,Vente,390000,,,LE VARVOUX,B041,38190,38039,Bernin,38,,,38039000AP0220,,,,,,,,,,,,,0,,,,,S,sols,,,77,5.864418,45.262679
2020-546500,2020-03-13,000002,Vente,390000,,,LE VARVOUX,B041,38190,38039,Bernin,38,,,38039000AP0221,,,,,,,,,,,,,0,,,,,S,sols,,,123,5.86435,45.262513
2020-546537,2020-05-14,000001,Vente,466100,5442,,LES REVOLEYS,B038,38190,38039,Bernin,38,,,38039000AL0246,,,,,,,,,,,,,0,1,Maison,170,7,S,sols,,,1080,5.86403,45.266901
2020-546538,2020-05-16,000001,Vente,450000,90,,CHE DE CRAPONOZ,0100,38190,38039,Bernin,38,,,38039000AC0338,,,,,,,,,,,,,0,1,Maison,110,4,S,sols,,,309,5.867856,45.272164
2020-546538,2020-05-16,000001,Vente,450000,90,,CHE DE CRAPONOZ,0100,38190,38039,Bernin,38,,,38039000AC0378,,,,,,,,,,,,,0,,,,,S,sols,,,86,5.867744,45.271944
2020-546549,2020-05-14,000001,Vente en l'état futur d'achèvement,268000,,,LES MICHELLIERES,B032,38190,38039,Bernin,38,,,38039000AC0404,,,32,,,,,,,,,,1,3,Dépendance,,0,,,,,,5.867016,45.271493
2020-546549,2020-05-14,000001,Vente en l'état futur d'achèvement,268000,,,LES MICHELLIERES,B032,38190,38039,Bernin,38,,,38039000AC0404,,,57,,,,,,,,,,1,2,Appartement,62,3,,,,,,5.867016,45.271493
2020-546619,2020-05-22,000001,Vente,265000,40,,CHE DE LA GARE,0110,38190,38039,Bernin,38,,,38039000AM0423,,,,,,,,,,,,,0,1,Maison,62,3,S,sols,,,518,5.866783,45.267875
2020-546619,2020-05-22,000001,Vente,265000,,,LES REVOLEYS,B038,38190,38039,Bernin,38,,,38039000AM0426,,,,,,,,,,,,,0,,,,,S,sols,,,7,5.866823,45.268006
2020-546621,2020-05-19,000001,Vente en l'état futur d'achèvement,347000,,,LES MICHELLIERES,B032,38190,38039,Bernin,38,,,38039000AC0404,,,12,,,,,,,,,,1,3,Dépendance,,0,,,,,,5.867016,45.271493
2020-546621,2020-05-19,000001,Vente en l'état futur d'achèvement,347000,,,LES MICHELLIERES,B032,38190,38039,Bernin,38,,,38039000AC0404,,,86,,,,,,,,,,1,2,Appartement,70,3,,,,,,5.867016,45.271493
2020-546622,2020-05-19,000001,Vente en l'état futur d'achèvement,274000,,,LES MICHELLIERES,B032,38190,38039,Bernin,38,,,38039000AC0404,,,48,,,,,,,,,,1,2,Appartement,62,3,,,,,,5.867016,45.271493
2020-546622,2020-05-19,000001,Vente en l'état futur d'achèvement,274000,,,LES MICHELLIERES,B032,38190,38039,Bernin,38,,,38039000AC0404,,,10,,,,,,,,,,1,3,Dépendance,,0,,,,,,5.867016,45.271493
2020-546723,2020-05-26,000001,Vente en l'état futur d'achèvement,271000,,,LES MICHELLIERES,B032,38190,38039,Bernin,38,,,38039000AC0404,,,46,,,,,,,,,,1,,,,,,,,,,5.867016,45.271493
2020-546723,2020-05-26,000001,Vente en l'état futur d'achèvement,271000,,,LES MICHELLIERES,B032,38190,38039,Bernin,38,,,38039000AC0404,,,30,,,,,,,,,,1,,,,,,,,,,5.867016,45.271493
2020-546862,2020-05-28,000001,Vente en l'état futur d'achèvement,261000,,,LES MICHELLIERES,B032,38190,38039,Bernin,38,,,38039000AC0404,,,44,,,,,,,,,,1,2,Appartement,64,3,,,,,,5.867016,45.271493
2020-546862,2020-05-28,000001,Vente en l'état futur d'achèvement,261000,,,LES MICHELLIERES,B032,38190,38039,Bernin,38,,,38039000AC0404,,,17,,,,,,,,,,1,3,Dépendance,,0,,,,,,5.867016,45.271493
2020-546896,2020-06-02,000001,Vente,651000,268,,CHEM DES CATIERES,0290,38190,38039,Bernin,38,,,38039000AH0103,,,,,,,,,,,,,0,1,Maison,149,5,S,sols,,,840,5.859863,45.266773
2020-547006,2020-06-08,000001,Vente en l'état futur d'achèvement,430000,,,LES MICHELLIERES,B032,38190,38039,Bernin,38,,,38039000AC0397,,,,,,,,,,,,,0,,,,,AB,terrains a bâtir,,,307,5.867275,45.271986
2020-547058,2020-05-29,000001,Vente,99181,110,,CHE DES MARECHALES,0138,38190,38039,Bernin,38,,,38039000AM0386,,,4,,,,,,,,,,1,3,Dépendance,,0,,,,,,5.870563,45.271967
2020-547058,2020-05-29,000001,Vente,99181,110,,CHE DES MARECHALES,0138,38190,38039,Bernin,38,,,38039000AM0386,,,5,,,,,,,,,,1,3,Dépendance,,0,,,,,,5.870563,45.271967
2020-547058,2020-05-29,000001,Vente,99181,110,,CHE DES MARECHALES,0138,38190,38039,Bernin,38,,,38039000AM0386,,,6,,,,,,,,,,1,3,Dépendance,,0,,,,,,5.870563,45.271967
2020-547058,2020-05-29,000001,Vente,99181,110,,CHE DES MARECHALES,0138,38190,38039,Bernin,38,,,38039000AM0386,,,1,32.01,,,,,,,,,1,2,Appartement,34,3,,,,,,5.870563,45.271967
2020-547081,2020-06-03,000001,Vente,278000,,,LA COTE,B017,38190,38039,Bernin,38,,,38039000AS0128,,,,,,,,,,,,,0,,,,,AB,terrains a bâtir,,,1081,5.868689,45.259814
2020-547203,2020-06-19,000001,Vente,238000,,,LES MARECHALES,B031,38190,38039,Bernin,38,,,38039000AM0511,,,,,,,,,,,,,0,,,,,T,terres,,,525,,
2020-547446,2020-07-02,000002,Vente,500000,134,,CHE DE LA ROUSSE,0170,38190,38039,Bernin,38,,,38039000AE0348,,,,,,,,,,,,,0,,,,,S,sols,,,120,5.859636,45.268938
2020-547446,2020-07-02,000002,Vente,500000,134,,CHE DE LA ROUSSE,0170,38190,38039,Bernin,38,,,38039000AE0354,,,,,,,,,,,,,0,,,,,S,sols,,,1145,5.859291,45.268917
2020-547476,2020-06-12,000003,Vente,240000,,,LE VARVOUX,B041,38190,38039,Bernin,38,,,38039000AL0111,,,,,,,,,,,,,0,,,,,S,sols,,,23,5.861855,45.262495
2020-547476,2020-06-12,000003,Vente,240000,5176,,LE VARVOUX,B041,38190,38039,Bernin,38,,,38039000AL0389,,,,,,,,,,,,,0,1,Maison,115,3,,,,,,5.86194,45.262647
2020-547476,2020-06-12,000003,Vente,240000,,,CHE DES BATELLIERES,0022,38190,38039,Bernin,38,,,38039000AL0392,,,,,,,,,,,,,0,,,,,S,sols,,,21,5.862051,45.262583
2020-547519,2020-07-09,000001,Vente,160620,89,,CHE DES MICHELLIERES,0142,38190,38039,Bernin,38,,,38039000AD0155,,,,,,,,,,,,,0,1,Maison,50,2,S,sols,,,126,5.865827,45.27003
2020-547672,2020-07-15,000001,Vente,430000,,,LES FONTAINES,B020,38190,38039,Bernin,38,,,38039000AN0213,,,,,,,,,,,,,0,,,,,S,sols,,,126,5.874554,45.269298
2020-547672,2020-07-15,000001,Vente,430000,112,,CHE DU TEURRA,0201,38190,38039,Bernin,38,,,38039000AN0251,,,,,,,,,,,,,0,4,Local industriel. commercial ou assimilé,613,0,S,sols,,,1558,5.874305,45.269128
2020-547701,2020-06-03,000001,Vente,222000,,,LES GRANDES TERRES,B025,38190,38039,Bernin,38,,,38039000AM0564,,,,,,,,,,,,,0,,,,,VI,vignes,,,157,5.871405,45.270063
2020-547701,2020-06-03,000001,Vente,222000,,,LES GRANDES TERRES,B025,38190,38039,Bernin,38,,,38039000AM0581,,,,,,,,,,,,,0,,,,,VE,vergers,NOYER,Noyeraie ou noyers,499,5.871319,45.269968
2020-547718,2020-07-24,000001,Vente en l'état futur d'achèvement,287000,5871,,LE VILLAGE,B044,38190,38039,Bernin,38,,,38039000AC0087,,,2,,,,,,,,,,1,,,,,,,,,,5.868546,45.272347
2020-547718,2020-07-24,000001,Vente en l'état futur d'achèvement,287000,5871,,LE VILLAGE,B044,38190,38039,Bernin,38,,,38039000AC0087,,,1,,,,,,,,,,1,,,,,,,,,,5.868546,45.272347
2020-547917,2020-07-31,000001,Vente en l'état futur d'achèvement,422000,191,,CHE DES RESERVOIRS,0163,38190,38039,Bernin,38,,,38039000AM0192,,,38,,,,,,,,,,1,3,Dépendance,,0,,,,,,5.869868,45.270533
2020-547917,2020-07-31,000001,Vente en l'état futur d'achèvement,422000,191,,CHE DES RESERVOIRS,0163,38190,38039,Bernin,38,,,38039000AM0192,,,34,,,,,,,,,,1,3,Dépendance,,0,,,,,,5.869868,45.270533
2020-547917,2020-07-31,000001,Vente en l'état futur d'achèvement,422000,161,,CHE DES RESERVOIRS,0163,38190,38039,Bernin,38,,,38039000AM0192,,,11,,,,,,,,,,1,2,Appartement,104,5,,,,,,5.869868,45.270533
2020-547992,2020-07-31,000001,Vente,577000,337,,CHE DES BATELLIERES,0022,38190,38039,Bernin,38,,,38039000AL0316,,,,,,,,,,,,,0,1,Maison,128,5,S,sols,,,837,5.86259,45.262915
2020-548055,2020-07-28,000001,Vente,50,,,GRAMONT,B023,38190,38039,Bernin,38,,,38039000AW0262,,,,,,,,,,,,,0,,,,,S,sols,,,19,5.886018,45.260054
2020-548138,2020-08-06,000001,Vente,206000,913,,CHE DE CRAPONOZ,0100,38190,38039,Bernin,38,,,38039000AA0087,,,,,,,,,,,,,0,,,,,S,sols,,,5,5.859953,45.276732
2020-548138,2020-08-06,000001,Vente,206000,5015,,CRAPONOZ,B018,38190,38039,Bernin,38,,,38039000AA0091,,,,,,,,,,,,,0,1,Maison,84,5,S,sols,,,104,5.859888,45.276794
2020-548178,2020-08-04,000001,Vente,3000,,,LES PETITES EYMES,B034,38190,38039,Bernin,38,,,38039000AE0047,,,,,,,,,,,,,0,,,,,BS,taillis sous futaie,,,1944,5.855481,45.269878
2020-548179,2020-08-04,000002,Vente,1600,,,LOT LES HAUTS DE BERNIN,A037,38190,38039,Bernin,38,,,38039000AE0358,,,,,,,,,,,,,0,,,,,S,sols,,,4,5.857901,45.269828
2020-548240,2020-08-07,000001,Vente en l'état futur d'achèvement,425000,,,LES MICHELLIERES,B032,38190,38039,Bernin,38,,,38039000AC0400,,,,,,,,,,,,,0,,,,,AB,terrains a bâtir,,,277,5.866873,45.271643
2020-548382,2020-08-25,000001,Vente en l'état futur d'achèvement,460000,,,LES MICHELLIERES,B032,38190,38039,Bernin,38,,,38039000AC0398,,,,,,,,,,,,,0,,,,,AB,terrains a bâtir,,,379,5.867064,45.27192
2020-548480,2020-08-25,000001,Vente,408000,5975,,LES FONTAINES,B020,38190,38039,Bernin,38,,,38039000AV0310,,,84,,,,,,,,,,1,4,Local industriel. commercial ou assimilé,10,0,,,,,,5.876034,45.264981
2020-548480,2020-08-25,000001,Vente,408000,5975,,LES FONTAINES,B020,38190,38039,Bernin,38,,,38039000AV0310,,,81,,,,,,,,,,1,4,Local industriel. commercial ou assimilé,10,0,,,,,,5.876034,45.264981
2020-548480,2020-08-25,000001,Vente,408000,5975,,LES FONTAINES,B020,38190,38039,Bernin,38,,,38039000AV0310,,,121,367.93,,,,,,,,,1,4,Local industriel. commercial ou assimilé,368,0,,,,,,5.876034,45.264981
2020-548480,2020-08-25,000001,Vente,408000,5975,,LES FONTAINES,B020,38190,38039,Bernin,38,,,38039000AV0310,,,85,,,,,,,,,,1,4,Local industriel. commercial ou assimilé,10,0,,,,,,5.876034,45.264981
2020-548480,2020-08-25,000001,Vente,408000,5975,,LES FONTAINES,B020,38190,38039,Bernin,38,,,38039000AV0310,,,82,,,,,,,,,,1,4,Local industriel. commercial ou assimilé,10,0,,,,,,5.876034,45.264981
2020-548480,2020-08-25,000001,Vente,408000,5975,,LES FONTAINES,B020,38190,38039,Bernin,38,,,38039000AV0310,,,83,,,,,,,,,,1,4,Local industriel. commercial ou assimilé,10,0,,,,,,5.876034,45.264981
2020-548480,2020-08-25,000001,Vente,408000,5975,,LES FONTAINES,B020,38190,38039,Bernin,38,,,38039000AV0310,,,90,,,,,,,,,,1,4,Local industriel. commercial ou assimilé,10,0,,,,,,5.876034,45.264981
2020-548480,2020-08-25,000001,Vente,408000,5975,,LES FONTAINES,B020,38190,38039,Bernin,38,,,38039000AV0310,,,86,,,,,,,,,,1,4,Local industriel. commercial ou assimilé,10,0,,,,,,5.876034,45.264981
2020-548480,2020-08-25,000001,Vente,408000,5975,,LES FONTAINES,B020,38190,38039,Bernin,38,,,38039000AV0310,,,87,,,,,,,,,,1,4,Local industriel. commercial ou assimilé,10,0,,,,,,5.876034,45.264981
2020-548480,2020-08-25,000001,Vente,408000,5975,,LES FONTAINES,B020,38190,38039,Bernin,38,,,38039000AV0310,,,88,,,,,,,,,,1,4,Local industriel. commercial ou assimilé,10,0,,,,,,5.876034,45.264981
2020-548480,2020-08-25,000001,Vente,408000,5975,,LES FONTAINES,B020,38190,38039,Bernin,38,,,38039000AV0310,,,89,,,,,,,,,,1,4,Local industriel. commercial ou assimilé,10,0,,,,,,5.876034,45.264981
2020-548516,2020-08-26,000001,Vente,470350,,,LES GRANDES TERRES,B025,38190,38039,Bernin,38,,,38039000AN0084,,,,,,,,,,,,,0,,,,,S,sols,,,2416,5.872553,45.268839
2020-548516,2020-08-26,000001,Vente,470350,5672,,LES GRANDES TERRES,B025,38190,38039,Bernin,38,,,38039000AN0087,,,,,,,,,,,,,0,1,Maison,92,4,S,sols,,,1132,5.87189,45.269371
2020-548516,2020-08-26,000001,Vente,470350,,,LES GRANDES TERRES,B025,38190,38039,Bernin,38,,,38039000AN0098,,,,,,,,,,,,,0,,,,,T,terres,,,2144,5.873268,45.269384
2020-548582,2020-08-28,000001,Vente,647500,1,,LA VEYRIE,B043,38190,38039,Bernin,38,,,38039000AP0024,,,,,,,,,,,,,0,1,Maison,145,5,S,sols,,,1006,5.86125,45.257296
2020-548582,2020-08-28,000001,Vente,647500,,,LA VEYRIE,B043,38190,38039,Bernin,38,,,38039000AP0185,,,,,,,,,,,,,0,,,,,AG,terrains d'agrément,,,100,5.861222,45.257078
2020-548620,2020-09-01,000001,Vente terrain à bâtir,240000,,,LES MARECHALES,B031,38190,38039,Bernin,38,,,38039000AM0588,,,,,,,,,,,,,0,,,,,T,terres,,,53,5.870201,45.271472
2020-548620,2020-09-01,000001,Vente terrain à bâtir,240000,,,LES MARECHALES,B031,38190,38039,Bernin,38,,,38039000AM0596,,,,,,,,,,,,,0,,,,,T,terres,,,541,5.870294,45.271404
2020-548630,2020-09-17,000001,Vente,435000,5530,,LE BALLOIS,B001,38190,38039,Bernin,38,,,38039000AE0169,,,,,,,,,,,,,0,1,Maison,87,3,S,sols,,,1727,,
2020-548630,2020-09-17,000001,Vente,435000,477,,CHE DES COMMUNAUX,0094,38190,38039,Bernin,38,,,38039000AE0170,,,,,,,,,,,,,0,,,,,S,sols,,,131,,
2020-548651,2020-09-01,000001,Vente terrain à bâtir,240000,,,LES MARECHALES,B031,38190,38039,Bernin,38,,,38039000AM0586,,,,,,,,,,,,,0,,,,,T,terres,,,317,5.870325,45.271724
2020-548651,2020-09-01,000001,Vente terrain à bâtir,240000,,,LES MARECHALES,B031,38190,38039,Bernin,38,,,38039000AM0594,,,,,,,,,,,,,0,,,,,T,terres,,,494,5.870609,45.271731
2020-548764,2020-09-11,000001,Vente en l'état futur d'achèvement,355000,,,LES MICHELLIERES,B032,38190,38039,Bernin,38,,,38039000AC0404,,,29,,,,,,,,,,1,3,Dépendance,,0,,,,,,5.867016,45.271493
2020-548764,2020-09-11,000001,Vente en l'état futur d'achèvement,355000,,,LES MICHELLIERES,B032,38190,38039,Bernin,38,,,38039000AC0404,,,81,,,,,,,,,,1,2,Appartement,82,4,,,,,,5.867016,45.271493
2020-548835,2020-09-25,000001,Vente,237600,5233,,LES MARECHALES,B031,38190,38039,Bernin,38,,,38039000AM0097,,,,,,,,,,,,,0,1,Maison,65,3,S,sols,,,46,5.868539,45.271451
2020-548835,2020-09-25,000001,Vente,237600,,,LES MARECHALES,B031,38190,38039,Bernin,38,,,38039000AM0306,,,,,,,,,,,,,0,,,,,S,sols,,,17,5.868631,45.271413