id_mutation,date_mutation,numero_disposition,nature_mutation,valeur_fonciere,adresse_numero,adresse_suffixe,adresse_nom_voie,adresse_code_voie,code_postal,code_commune,nom_commune,code_departement,ancien_code_commune,ancien_nom_commune,id_parcelle,ancien_id_parcelle,numero_volume,lot1_numero,lot1_surface_carrez,lot2_numero,lot2_surface_carrez,lot3_numero,lot3_surface_carrez,lot4_numero,lot4_surface_carrez,lot5_numero,lot5_surface_carrez,nombre_lots,code_type_local,type_local,surface_reelle_bati,nombre_pieces_principales,code_nature_culture,nature_culture,code_nature_culture_speciale,nature_culture_speciale,surface_terrain,longitude,latitude
2020-572322,2020-01-24,000002,Echange,1040,,,TERRE DU CHATEAU,B047,38470,38086,Chasselay,38,,,380860000C0552,,,,,,,,,,,,,0,,,,,S,sols,,,63,5.339257,45.257639
2020-572322,2020-01-24,000003,Echange,1040,,,TERRE DU CHATEAU,B047,38470,38086,Chasselay,38,,,380860000C0550,,,,,,,,,,,,,0,,,,,S,sols,,,104,5.339125,45.257554
2020-572325,2020-01-24,000001,Vente,30000,,,TERRE DU CHATEAU,B047,38470,38086,Chasselay,38,,,380860000C0549,,,,,,,,,,,,,0,,,,,AB,terrains a bâtir,,,550,5.339179,45.25774
2020-572325,2020-01-24,000001,Vente,30000,,,TERRE DU CHATEAU,B047,38470,38086,Chasselay,38,,,380860000C0552,,,,,,,,,,,,,0,,,,,S,sols,,,63,5.339257,45.257639
2020-572360,2020-02-03,000001,Vente,70000,,,LA CALLADIERE ET BRIAILLE,B009,38470,38086,Chasselay,38,,,380860000B1047,,,,,,,,,,,,,0,,,,,AB,terrains a bâtir,,,1355,5.340595,45.258064
2020-572629,2020-02-14,000002,Vente,1,,,LES URSULES,B048,38470,38086,Chasselay,38,,,380860000C0566,,,,,,,,,,,,,0,,,,,J,jardins,POTAG,Jardin potager,95,5.336786,45.255851
2020-572647,2020-04-06,000001,Vente,188350,74,,IMP DE LA CALLADIERE,0043,38470,38086,Chasselay,38,,,380860000B0994,,,,,,,,,,,,,0,1,Maison,149,5,S,sols,,,1465,5.340083,45.25822
2020-572870,2020-05-19,000001,Vente,190000,,,SAINT ALBAN,B046,38470,38086,Chasselay,38,,,380860000A0139,,,,,,,,,,,,,0,,,,,PA,pâtures,PATUR,Pâture plantée,3820,5.335289,45.270402
2020-572870,2020-05-19,000001,Vente,190000,,,SAINT ALBAN,B046,38470,38086,Chasselay,38,,,380860000A0140,,,,,,,,,,,,,0,,,,,PA,pâtures,PATUR,Pâture plantée,2040,5.335817,45.270143
2020-572870,2020-05-19,000001,Vente,190000,,,LES VIGNES,B051,38470,38086,Chasselay,38,,,380860000A0406,,,,,,,,,,,,,0,,,,,T,terres,,,3590,5.336857,45.269783
2020-572870,2020-05-19,000001,Vente,190000,,,LES VIGNES,B051,38470,38086,Chasselay,38,,,380860000A0407,,,,,,,,,,,,,0,,,,,BT,taillis simples,,,1455,5.336641,45.270242
2020-572870,2020-05-19,000001,Vente,190000,,,LES VIGNES,B051,38470,38086,Chasselay,38,,,380860000A0408,,,,,,,,,,,,,0,,,,,PA,pâtures,PATUR,Pâture plantée,1050,5.336432,45.269967
2020-572870,2020-05-19,000001,Vente,190000,,,LES VIGNES,B051,38470,38086,Chasselay,38,,,380860000A0409,,,,,,,,,,,,,0,,,,,BT,taillis simples,,,945,5.336192,45.270296
2020-572870,2020-05-19,000001,Vente,190000,,,LES VIGNES,B051,38470,38086,Chasselay,38,,,380860000A0410,,,,,,,,,,,,,0,,,,,PA,pâtures,PATUR,Pâture plantée,2025,5.335777,45.269972
2020-572870,2020-05-19,000001,Vente,190000,,,LES VIGNES,B051,38470,38086,Chasselay,38,,,380860000A0412,,,,,,,,,,,,,0,,,,,VE,vergers,NOYER,Noyeraie ou noyers,2280,5.33546,45.269368
2020-572870,2020-05-19,000001,Vente,190000,5042,,LES VIGNES,B051,38470,38086,Chasselay,38,,,380860000A0690,,,,,,,,,,,,,0,1,Maison,130,5,S,sols,,,1810,5.33617,45.269321
2020-572870,2020-05-19,000001,Vente,190000,5042,,LES VIGNES,B051,38470,38086,Chasselay,38,,,380860000A0690,,,,,,,,,,,,,0,1,Maison,130,5,P,prés,,,1205,5.33617,45.269321
2020-572970,2020-06-15,000001,Vente,263400,260,,CHE DES NIERES,0270,38470,38086,Chasselay,38,,,380860000A0572,,,,,,,,,,,,,0,1,Maison,146,3,S,sols,,,255,5.347745,45.273522
2020-572970,2020-06-15,000001,Vente,263400,260,,CHE DES NIERES,0270,38470,38086,Chasselay,38,,,380860000A0572,,,,,,,,,,,,,0,1,Maison,55,2,S,sols,,,255,5.347745,45.273522
2020-572970,2020-06-15,000001,Vente,263400,,,LES NIERES,B040,38470,38086,Chasselay,38,,,380860000A0703,,,,,,,,,,,,,0,,,,,VE,vergers,NOYER,Noyeraie ou noyers,1500,5.347719,45.273432
2020-573607,2020-09-21,000002,Vente,48000,,,BEAUVILLARD,B001,38470,38086,Chasselay,38,,,380860000C0569,,,,,,,,,,,,,0,,,,,T,terres,,,9,5.325934,45.257216
2020-573607,2020-09-21,000002,Vente,48000,114,,IMP DE BEAUVILLARD,0025,38470,38086,Chasselay,38,,,380860000C0571,,,,,,,,,,,,,0,1,Maison,120,3,,,,,,5.325731,45.257118
2020-573624,2020-10-09,000001,Vente,4500,,,CHAMP VINCENT,B013,38470,38086,Chasselay,38,,,380860000A0038,,,,,,,,,,,,,0,,,,,BT,taillis simples,CHAT,Châtaigneraie,1290,5.338924,45.264886
2020-573624,2020-10-09,000001,Vente,4500,,,CHAMP VINCENT,B013,38470,38086,Chasselay,38,,,380860000A0039,,,,,,,,,,,,,0,,,,,BT,taillis simples,,,2080,5.338737,45.265161
2020-573624,2020-10-09,000001,Vente,4500,,,CHAMP VINCENT,B013,38470,38086,Chasselay,38,,,380860000A0040,,,,,,,,,,,,,0,,,,,T,terres,,,7775,5.338958,45.265485
2020-573624,2020-10-09,000001,Vente,4500,,,CHAMP VINCENT,B013,38470,38086,Chasselay,38,,,380860000A0041,,,,,,,,,,,,,0,,,,,T,terres,,,7800,5.33893,45.266437
2020-573624,2020-10-09,000001,Vente,4500,,,CHAMP VINCENT,B013,38470,38086,Chasselay,38,,,380860000A0041,,,,,,,,,,,,,0,,,,,T,terres,,,7800,5.33893,45.266437
2020-573624,2020-10-09,000001,Vente,4500,,,CHAMP VINCENT,B013,38470,38086,Chasselay,38,,,380860000A0042,,,,,,,,,,,,,0,,,,,BT,taillis simples,,,5245,5.337782,45.266131
2020-573624,2020-10-09,000001,Vente,4500,,,SAINT ALBAN,B046,38470,38086,Chasselay,38,,,380860000A0131,,,,,,,,,,,,,0,,,,,BT,taillis simples,CHAT,Châtaigneraie,1435,5.338058,45.2676
2020-573629,2020-10-07,000001,Vente,13000,,,LA BOURELIERE,B007,38470,38086,Chasselay,38,,,380860000C0540,,,,,,,,,,,,,0,,,,,P,prés,,,5155,5.33562,45.249367
2020-573629,2020-10-07,000001,Vente,13000,,,LA BOURELIERE,B007,38470,38086,Chasselay,38,,,380860000C0540,,,,,,,,,,,,,0,,,,,T,terres,,,4936,5.33562,45.249367
2020-573790,2020-10-28,000001,Vente,63000,,,CHAMP DE LA CROIX,B011,38470,38086,Chasselay,38,,,380860000C0560,,,,,,,,,,,,,0,,,,,AB,terrains a bâtir,,,755,5.3393,45.25691
2020-573790,2020-10-28,000001,Vente,63000,,,CHAMP DE LA CROIX,B011,38470,38086,Chasselay,38,,,380860000C0563,,,,,,,,,,,,,0,,,,,S,sols,,,137,5.339215,45.256881
2020-573863,2020-11-04,000001,Vente,520000,,,GRAND PRE,B032,38470,38086,Chasselay,38,,,380860000C0405,,,,,,,,,,,,,0,,,,,P,prés,,,9419,5.334392,45.256791
2020-573863,2020-11-04,000001,Vente,520000,,,TERRE DU CHATEAU,B047,38470,38086,Chasselay,38,,,380860000C0464,,,,,,,,,,,,,0,,,,,S,sols,,,47,5.335554,45.257125
2020-573863,2020-11-04,000001,Vente,520000,,,TERRE DU CHATEAU,B047,38470,38086,Chasselay,38,,,380860000C0465,,,,,,,,,,,,,0,,,,,P,prés,,,5495,5.334235,45.257059
2020-573863,2020-11-04,000001,Vente,520000,87,,IMP DU CHATEAU,0055,38470,38086,Chasselay,38,,,380860000C0522,,,,,,,,,,,,,0,1,Maison,90,3,S,sols,,,1560,5.335363,45.257003
2020-573863,2020-11-04,000001,Vente,520000,87,,IMP DU CHATEAU,0055,38470,38086,Chasselay,38,,,380860000C0522,,,,,,,,,,,,,0,1,Maison,160,5,S,sols,,,1560,5.335363,45.257003
2020-573863,2020-11-04,000001,Vente,520000,87,,IMP DU CHATEAU,0055,38470,38086,Chasselay,38,,,380860000C0522,,,,,,,,,,,,,0,1,Maison,101,4,S,sols,,,1560,5.335363,45.257003
2020-573863,2020-11-04,000001,Vente,520000,,,TERRE DU CHATEAU,B047,38470,38086,Chasselay,38,,,380860000C0525,,,,,,,,,,,,,0,,,,,T,terres,,,111,5.335686,45.257102
