id_mutation,date_mutation,numero_disposition,nature_mutation,valeur_fonciere,adresse_numero,adresse_suffixe,adresse_nom_voie,adresse_code_voie,code_postal,code_commune,nom_commune,code_departement,ancien_code_commune,ancien_nom_commune,id_parcelle,ancien_id_parcelle,numero_volume,lot1_numero,lot1_surface_carrez,lot2_numero,lot2_surface_carrez,lot3_numero,lot3_surface_carrez,lot4_numero,lot4_surface_carrez,lot5_numero,lot5_surface_carrez,nombre_lots,code_type_local,type_local,surface_reelle_bati,nombre_pieces_principales,code_nature_culture,nature_culture,code_nature_culture_speciale,nature_culture_speciale,surface_terrain,longitude,latitude
2020-566080,2020-01-13,000001,Vente,428860,,,LE VILLAGE SUD,B028,38200,38110,Chuzelles,38,,,381100000A2572,,,,,,,,,,,,,0,,,,,S,sols,,,43,4.878971,45.58199
2020-566080,2020-01-13,000001,Vente,428860,5010,,LE VILLAGE SUD,B028,38200,38110,Chuzelles,38,,,381100000A3853,,,,,,,,,,,,,0,1,Maison,108,5,S,sols,,,881,4.878627,45.581976
2020-566080,2020-01-13,000001,Vente,428860,5010,,LE VILLAGE SUD,B028,38200,38110,Chuzelles,38,,,381100000A3853,,,,,,,,,,,,,0,3,Dépendance,,0,S,sols,,,881,4.878627,45.581976
2020-566216,2020-01-13,000002,Echange,500,,,LES SERPAIZIERES OUEST,B020,38200,38110,Chuzelles,38,,,381100000A3852,,,,,,,,,,,,,0,,,,,P,prés,,,167,4.879761,45.570669
2020-566252,2020-01-13,000001,Vente,26872,,,LES SERPAIZIERES OUEST,B020,38200,38110,Chuzelles,38,,,381100000A3851,,,,,,,,,,,,,0,,,,,P,prés,,,971,4.879834,45.570463
2020-566259,2020-01-13,000001,Vente,29610,,,LES SERPAIZIERES OUEST,B020,38200,38110,Chuzelles,38,,,381100000A3850,,,,,,,,,,,,,0,,,,,P,prés,,,1254,4.87975,45.5703
2020-566263,2020-01-13,000001,Vente,43518,,,LES SERPAIZIERES OUEST,B020,38200,38110,Chuzelles,38,,,381100000A3848,,,,,,,,,,,,,0,,,,,P,prés,,,922,4.879446,45.570022
2020-566263,2020-01-13,000001,Vente,43518,,,LES SERPAIZIERES OUEST,B020,38200,38110,Chuzelles,38,,,381100000A3849,,,,,,,,,,,,,0,,,,,P,prés,,,921,4.879554,45.57016
2020-566320,2020-01-10,000001,Vente,104000,5309,,COMBE BLEUE,B007,38200,38110,Chuzelles,38,,,381100000A1272,,,,,,,,,,,,,0,1,Maison,82,4,T,terres,,,502,4.882318,45.589994
2020-566320,2020-01-10,000001,Vente,104000,5309,,COMBE BLEUE,B007,38200,38110,Chuzelles,38,,,381100000A1272,,,,,,,,,,,,,0,1,Maison,82,4,T,terres,,,532,4.882318,45.589994
2020-566320,2020-01-10,000001,Vente,104000,5309,,COMBE BLEUE,B007,38200,38110,Chuzelles,38,,,381100000A1272,,,,,,,,,,,,,0,1,Maison,82,4,S,sols,,,600,4.882318,45.589994
2020-566337,2020-01-15,000001,Vente,384360,,,PAUPHILE,B015,38200,38110,Chuzelles,38,,,381100000A3719,,,,,,,,,,,,,0,,,,,S,sols,,,394,4.860402,45.565087
2020-566337,2020-01-15,000001,Vente,384360,340,D,CHE DE BOUSSOLE,0065,38200,38110,Chuzelles,38,,,381100000A3720,,,,,,,,,,,,,0,1,Maison,116,5,S,sols,,,776,4.860247,45.565208
2020-566629,2020-02-07,000001,Vente,405000,5542,,LE VILLAGE SUD,B028,38200,38110,Chuzelles,38,,,381100000A2047,,,,,,,,,,,,,0,3,Dépendance,,0,S,sols,,,861,4.874782,45.584899
2020-566629,2020-02-07,000001,Vente,405000,5542,,LE VILLAGE SUD,B028,38200,38110,Chuzelles,38,,,381100000A2047,,,,,,,,,,,,,0,1,Maison,101,5,S,sols,,,861,4.874782,45.584899
2020-566818,2020-02-13,000001,Vente,344000,,,LES DAUPHINES,B009,38200,38110,Chuzelles,38,,,381100000B0049,,,,,,,,,,,,,0,,,,,T,terres,,,6590,4.888725,45.58508
2020-566818,2020-02-13,000001,Vente,344000,5551,,LES DAUPHINES,B009,38200,38110,Chuzelles,38,,,381100000B0912,,,,,,,,,,,,,0,1,Maison,93,5,S,sols,,,1000,4.88894,45.584358
2020-566818,2020-02-13,000001,Vente,344000,5551,,LES DAUPHINES,B009,38200,38110,Chuzelles,38,,,381100000B0912,,,,,,,,,,,,,0,1,Maison,93,5,P,prés,,,1345,4.88894,45.584358
2020-566932,2020-02-18,000001,Vente,319000,5559,,BOUSSOLE,B003,38200,38110,Chuzelles,38,,,381100000A2146,,,,,,,,,,,,,0,3,Dépendance,,0,S,sols,,,1182,4.858556,45.572982
2020-566932,2020-02-18,000001,Vente,319000,5559,,BOUSSOLE,B003,38200,38110,Chuzelles,38,,,381100000A2146,,,,,,,,,,,,,0,1,Maison,108,4,S,sols,,,1182,4.858556,45.572982
2020-566944,2020-02-20,000001,Vente,250000,5146,,ST MAXIME,B023,38200,38110,Chuzelles,38,,,381100000B0594,,,,,,,,,,,,,0,1,Maison,67,4,S,sols,,,1118,4.871775,45.557277
2020-566944,2020-02-20,000001,Vente,250000,5146,,ST MAXIME,B023,38200,38110,Chuzelles,38,,,381100000B0594,,,,,,,,,,,,,0,3,Dépendance,,0,P,prés,,,895,4.871775,45.557277
2020-566944,2020-02-20,000001,Vente,250000,5146,,ST MAXIME,B023,38200,38110,Chuzelles,38,,,381100000B0594,,,,,,,,,,,,,0,3,Dépendance,,0,S,sols,,,1118,4.871775,45.557277
2020-566944,2020-02-20,000001,Vente,250000,5146,,ST MAXIME,B023,38200,38110,Chuzelles,38,,,381100000B0594,,,,,,,,,,,,,0,1,Maison,67,4,P,prés,,,895,4.871775,45.557277
2020-566944,2020-02-20,000001,Vente,250000,5146,,ST MAXIME,B023,38200,38110,Chuzelles,38,,,381100000B0594,,,,,,,,,,,,,0,1,Maison,67,4,P,prés,,,895,4.871775,45.557277
2020-566944,2020-02-20,000001,Vente,250000,5146,,ST MAXIME,B023,38200,38110,Chuzelles,38,,,381100000B0594,,,,,,,,,,,,,0,3,Dépendance,,0,P,prés,,,895,4.871775,45.557277
2020-566944,2020-02-20,000001,Vente,250000,,,ST MAXIME,B023,38200,38110,Chuzelles,38,,,381100000B0595,,,,,,,,,,,,,0,,,,,VE,vergers,,,989,4.872418,45.557338
2020-567310,2020-02-26,000001,Vente,430000,5,,COMBE BLEUE,B007,38200,38110,Chuzelles,38,,,381100000A3127,,,,,,,,,,,,,0,3,Dépendance,,0,S,sols,,,1177,4.883413,45.591119
2020-567310,2020-02-26,000001,Vente,430000,5,,COMBE BLEUE,B007,38200,38110,Chuzelles,38,,,381100000A3127,,,,,,,,,,,,,0,1,Maison,133,5,S,sols,,,1177,4.883413,45.591119
2020-567863,2020-05-20,000002,Vente,317500,5050,,LE VILLAGE NORD,B027,38200,38110,Chuzelles,38,,,381100000A3866,,,,,,,,,,,,,0,1,Maison,105,4,S,sols,,,248,4.880315,45.586139
2020-567863,2020-05-20,000002,Vente,317500,,,LE VILLAGE NORD,B027,38200,38110,Chuzelles,38,,,381100000A3868,,,,,,,,,,,,,0,,,,,S,sols,,,38,4.880426,45.586163
2020-567863,2020-05-20,000002,Vente,317500,,,LE VILLAGE NORD,B027,38200,38110,Chuzelles,38,,,381100000A3869,,,,,,,,,,,,,0,,,,,S,sols,,,17,,
2020-568010,2020-06-11,000001,Vente,192000,503,,RTE DE SEYSSUEL,0370,38200,38110,Chuzelles,38,,,381100000A3325,,,,,,,,,,,,,0,1,Maison,142,4,S,sols,,,1000,4.863607,45.568504
2020-568010,2020-06-11,000001,Vente,192000,503,,RTE DE SEYSSUEL,0370,38200,38110,Chuzelles,38,,,381100000A3325,,,,,,,,,,,,,0,1,Maison,142,4,AG,terrains d'agrément,,,339,4.863607,45.568504
2020-568302,2020-06-26,000001,Vente,340000,5479,,ST MAURICE,B022,38200,38110,Chuzelles,38,,,381100000A2242,,,,,,,,,,,,,0,1,Maison,106,4,S,sols,,,955,4.873158,45.585804
2020-568302,2020-06-26,000001,Vente,340000,,,ST MAURICE,B022,38200,38110,Chuzelles,38,,,381100000A2979,,,,,,,,,,,,,0,,,,,S,sols,,,114,4.872676,45.585789
2020-568316,2020-06-25,000001,Vente,378350,134,,RUE DU VERDIER,0405,38200,38110,Chuzelles,38,,,381100000A3408,,,,,,,,,,,,,0,1,Maison,156,7,S,sols,,,844,4.88021,45.587679
2020-568619,2020-06-09,000001,Vente,80000,,,LES MARTINIERES,B013,38200,38110,Chuzelles,38,,,381100000A3826,,,,,,,,,,,,,0,,,,,S,sols,,,235,4.858067,45.578711
2020-568619,2020-06-09,000001,Vente,80000,,,LES MARTINIERES,B013,38200,38110,Chuzelles,38,,,381100000A3827,,,,,,,,,,,,,0,,,,,S,sols,,,32,4.857964,45.578711
2020-568773,2020-07-07,000001,Vente,280000,5247,,TOURMENTE,B025,38200,38110,Chuzelles,38,,,381100000A1518,,,,,,,,,,,,,0,1,Maison,97,5,S,sols,,,730,,
2020-568773,2020-07-07,000001,Vente,280000,5247,,TOURMENTE,B025,38200,38110,Chuzelles,38,,,381100000A1518,,,,,,,,,,,,,0,1,Maison,97,5,P,prés,,,678,,
2020-568851,2020-03-11,000001,Vente,5000,,,LE VILLAGE SUD,B028,38200,38110,Chuzelles,38,,,381100000A3861,,,,,,,,,,,,,0,,,,,VE,vergers,,,915,4.881786,45.58489
2020-568851,2020-03-11,000001,Vente,5000,,,LE VILLAGE SUD,B028,38200,38110,Chuzelles,38,,,381100000A3862,,,,,,,,,,,,,0,,,,,T,terres,,,88,4.88188,45.584879
2020-569064,2020-07-30,000001,Vente,495000,,,PAUPHILE,B015,38200,38110,Chuzelles,38,,,381100000A3735,,,,,,,,,,,,,0,,,,,AB,terrains a bâtir,,,392,4.860939,45.562808
2020-569064,2020-07-30,000001,Vente,495000,624,,CHE DE BOUSSOLE,0065,38200,38110,Chuzelles,38,,,381100000A3737,,,,,,,,,,,,,0,3,Dépendance,,0,S,sols,,,320,4.860717,45.562891
2020-569064,2020-07-30,000001,Vente,495000,624,,CHE DE BOUSSOLE,0065,38200,38110,Chuzelles,38,,,381100000A3737,,,,,,,,,,,,,0,1,Maison,141,4,S,sols,,,320,4.860717,45.562891
2020-569079,2020-07-30,000001,Vente,20000,,,DEVILLIERES ET PICHONNIERE,B010,38200,38110,Chuzelles,38,,,381100000B0648,,,,,,,,,,,,,0,,,,,P,prés,,,8482,4.880558,45.566825
2020-569079,2020-07-30,000001,Vente,20000,,,DEVILLIERES ET PICHONNIERE,B010,38200,38110,Chuzelles,38,,,381100000B0649,,,,,,,,,,,,,0,,,,,T,terres,,,4318,4.881365,45.566876
2020-569125,2020-07-09,000001,Vente,442000,5448,,COMBE BLEUE,B007,38200,38110,Chuzelles,38,,,381100000A3837,,,,,,,,,,,,,0,1,Maison,135,4,S,sols,,,1450,4.883194,45.591293
2020-569318,2020-08-18,000001,Vente,569000,5453,,LES MARTINIERES,B013,38200,38110,Chuzelles,38,,,381100000A1859,,,,,,,,,,,,,0,3,Dépendance,,0,AG,terrains d'agrément,,,1236,4.863712,45.578519
2020-569318,2020-08-18,000001,Vente,569000,5453,,LES MARTINIERES,B013,38200,38110,Chuzelles,38,,,381100000A1859,,,,,,,,,,,,,0,3,Dépendance,,0,S,sols,,,1086,4.863712,45.578519
2020-569318,2020-08-18,000001,Vente,569000,5453,,LES MARTINIERES,B013,38200,38110,Chuzelles,38,,,381100000A1859,,,,,,,,,,,,,0,1,Maison,103,4,S,sols,,,1086,4.863712,45.578519
2020-569318,2020-08-18,000001,Vente,569000,5453,,LES MARTINIERES,B013,38200,38110,Chuzelles,38,,,381100000A1859,,,,,,,,,,,,,0,1,Maison,103,4,AG,terrains d'agrément,,,1236,4.863712,45.578519
2020-569318,2020-08-18,000001,Vente,569000,,,LES MARTINIERES,B013,38200,38110,Chuzelles,38,,,381100000A2578,,,,,,,,,,,,,0,,,,,T,terres,,,1121,4.863331,45.578471
2020-569318,2020-08-18,000001,Vente,569000,,,LES MARTINIERES,B013,38200,38110,Chuzelles,38,,,381100000A2579,,,,,,,,,,,,,0,,,,,T,terres,,,10,4.86438,45.578396
2020-569896,2020-09-18,000001,Vente,244250,134,,RUE DU VERDIER,0405,38200,38110,Chuzelles,38,,,381100000A3428,,,15,64.08,,,,,,,,,1,2,Appartement,64,3,,,,,,4.879917,45.586611
2020-569896,2020-09-18,000001,Vente,244250,134,,RUE DU VERDIER,0405,38200,38110,Chuzelles,38,,,381100000A3429,,3,,,,,,,,,,,0,,,,,,,,,,4.87956,45.586484
2020-569896,2020-09-18,000001,Vente,244250,,,LE VILLAGE NORD,B027,38200,38110,Chuzelles,38,,,381100000A3478,,,,,,,,,,,,,0,,,,,S,sols,,,17,4.88015,45.586595
2020-570075,2020-09-30,000001,Vente,480000,557,,CHE DE BOUSSOLE,0065,38200,38110,Chuzelles,38,,,381100000A3598,,,,,,,,,,,,,0,3,Dépendance,,0,S,sols,,,863,4.861442,45.563478
2020-570075,2020-09-30,000001,Vente,480000,557,,CHE DE BOUSSOLE,0065,38200,38110,Chuzelles,38,,,381100000A3598,,,,,,,,,,,,,0,1,Maison,110,4,S,sols,,,863,4.861442,45.563478
2020-570146,2020-10-12,000001,Vente,424750,5409,,LE VERDIER,B026,38200,38110,Chuzelles,38,,,381100000A1799,,,,,,,,,,,,,0,1,Maison,128,6,S,sols,,,815,4.881158,45.590704
2020-570155,2020-09-25,000001,Vente,469500,5505,,LE VILLAGE SUD,B028,38200,38110,Chuzelles,38,,,381100000A2046,,,,,,,,,,,,,0,3,Dépendance,,0,S,sols,,,1095,4.874613,45.584445
2020-570155,2020-09-25,000001,Vente,469500,5505,,LE VILLAGE SUD,B028,38200,38110,Chuzelles,38,,,381100000A2046,,,,,,,,,,,,,0,1,Maison,105,5,S,sols,,,1095,4.874613,45.584445
2020-570382,2020-10-16,000001,Vente,429000,1111,A,BOUSSOLE,B003,38200,38110,Chuzelles,38,,,381100000A3376,,,,,,,,,,,,,0,3,Dépendance,,0,S,sols,,,916,4.858227,45.569225
2020-570382,2020-10-16,000001,Vente,429000,1111,A,BOUSSOLE,B003,38200,38110,Chuzelles,38,,,381100000A3376,,,,,,,,,,,,,0,1,Maison,114,5,S,sols,,,916,4.858227,45.569225
2020-570465,2020-10-08,000001,Vente,19137,,,CHASSON,B005,38200,38110,Chuzelles,38,,,381100000B0121,,,,,,,,,,,,,0,,,,,VI,vignes,,,710,4.89554,45.572352
2020-570465,2020-10-08,000001,Vente,19137,,,CHASSON,B005,38200,38110,Chuzelles,38,,,381100000B0123,,,,,,,,,,,,,0,,,,,T,terres,,,2180,4.896868,45.572482
2020-570471,2020-10-12,000001,Vente,280000,44,,IMP RODET,0320,38200,38110,Chuzelles,38,,,381100000A3189,,,,,,,,,,,,,0,3,Dépendance,,0,S,sols,,,1241,4.863287,45.555723
2020-570471,2020-10-12,000001,Vente,280000,44,,IMP RODET,0320,38200,38110,Chuzelles,38,,,381100000A3189,,,,,,,,,,,,,0,1,Maison,107,5,S,sols,,,1241,4.863287,45.555723
2020-570471,2020-10-12,000001,Vente,280000,,,PAUPHILE,B015,38200,38110,Chuzelles,38,,,381100000A3195,,,,,,,,,,,,,0,,,,,S,sols,,,174,4.862824,45.555854
2020-570471,2020-10-12,000001,Vente,280000,,,PAUPHILE,B015,38200,38110,Chuzelles,38,,,381100000A3196,,,,,,,,,,,,,0,,,,,S,sols,,,29,4.862852,45.555851
2020-570471,2020-10-12,000001,Vente,280000,,,PAUPHILE,B015,38200,38110,Chuzelles,38,,,381100000A3199,,,,,,,,,,,,,0,,,,,S,sols,,,393,4.86312,45.555533
2020-570581,2020-10-26,000001,Vente,315000,134,,RUE DU VERDIER,0405,38200,38110,Chuzelles,38,,,381100000A3410,,,,,,,,,,,,,0,1,Maison,102,5,S,sols,,,348,4.879953,45.587307
2020-570633,2020-10-22,000001,Vente,283480,4,,LE BELVEDERE DE CHUZELLES,A006,38200,38110,Chuzelles,38,,,381100000A2913,,,20,,,,,,,,,,1,1,Maison,95,4,,,,,,4.878215,45.585915
2020-570984,2020-11-06,000001,Vente,270000,12,,LE BELVEDERE DE CHUZELLES,A006,38200,38110,Chuzelles,38,,,381100000A2913,,,15,103.44,,,,,,,,,1,1,Maison,104,5,,,,,,4.878215,45.585915
2020-571029,2020-11-04,000002,Vente,50000,,,BOUSSOLE,B003,38200,38110,Chuzelles,38,,,381100000A3879,,,,,,,,,,,,,0,,,,,AB,terrains a bâtir,,,293,4.86085,45.567847
2020-571029,2020-11-04,000002,Vente,50000,,,BOUSSOLE,B003,38200,38110,Chuzelles,38,,,381100000A3880,,,,,,,,,,,,,0,,,,,AB,terrains a bâtir,,,88,4.86068,45.567682
2020-571029,2020-11-04,000002,Vente,50000,,,BOUSSOLE,B003,38200,38110,Chuzelles,38,,,381100000A3881,,,,,,,,,,,,,0,,,,,AB,terrains a bâtir,,,247,4.860634,45.567646
2020-571029,2020-11-04,000002,Vente,50000,,,BOUSSOLE,B003,38200,38110,Chuzelles,38,,,381100000A3882,,,,,,,,,,,,,0,,,,,AB,terrains a bâtir,,,804,4.860873,45.567701
2020-571029,2020-11-04,000002,Vente,50000,,,BOUSSOLE,B003,38200,38110,Chuzelles,38,,,381100000A3883,,,,,,,,,,,,,0,,,,,AB,terrains a bâtir,,,89,4.861126,45.567742
2020-571029,2020-11-04,000002,Vente,50000,,,BOUSSOLE,B003,38200,38110,Chuzelles,38,,,381100000A3884,,,,,,,,,,,,,0,,,,,AB,terrains a bâtir,,,9,4.860755,45.567524
2020-571110,2020-11-03,000001,Vente,628000,5435,,PAUPHILE,B015,38200,38110,Chuzelles,38,,,381100000A3183,,,,,,,,,,,,,0,3,Dépendance,,0,S,sols,,,974,4.862332,45.561189
2020-571110,2020-11-03,000001,Vente,628000,5435,,PAUPHILE,B015,38200,38110,Chuzelles,38,,,381100000A3183,,,,,,,,,,,,,0,1,Maison,133,4,S,sols,,,974,4.862332,45.561189
2020-571110,2020-11-03,000001,Vente,628000,,,PAUPHILE,B015,38200,38110,Chuzelles,38,,,381100000A3184,,,,,,,,,,,,,0,,,,,T,terres,,,627,4.862055,45.561335
2020-571301,2020-11-10,000001,Vente,218000,92,,RUE DE LA CROIX DE TOURMENTE,0130,38200,38110,Chuzelles,38,,,381100000A3525,,,2,65.93,,,,,,,,,1,2,Appartement,66,3,,,,,,4.879329,45.585459
2020-571301,2020-11-10,000001,Vente,218000,92,,RUE DE LA CROIX DE TOURMENTE,0130,38200,38110,Chuzelles,38,,,381100000A3525,,,18,,,,,,,,,,1,3,Dépendance,,0,,,,,,4.879329,45.585459
2020-571301,2020-11-10,000001,Vente,218000,92,,RUE DE LA CROIX DE TOURMENTE,0130,38200,38110,Chuzelles,38,,,381100000A3525,,,19,,,,,,,,,,1,3,Dépendance,,0,,,,,,4.879329,45.585459
2020-571607,2020-11-06,000002,Vente,357000,9002,,CHE DE BOUSSOLE,0065,38200,38110,Chuzelles,38,,,381100000A3906,,,,,,,,,,,,,0,1,Maison,81,3,S,sols,,,823,4.861567,45.561971
2020-571607,2020-11-06,000002,Vente,357000,,,PAUPHILE,B015,38200,38110,Chuzelles,38,,,381100000A3908,,,,,,,,,,,,,0,,,,,S,sols,,,124,4.861436,45.562012
2020-571607,2020-11-06,000002,Vente,357000,,,PAUPHILE,B015,38200,38110,Chuzelles,38,,,381100000A3909,,,,,,,,,,,,,0,,,,,S,sols,,,32,4.861384,45.561943
2020-571635,2020-11-10,000001,Vente,1,,,BOUSSOLE,B003,38200,38110,Chuzelles,38,,,381100000A3882,,,,,,,,,,,,,0,,,,,AB,terrains a bâtir,,,804,4.860873,45.567701
2020-571635,2020-11-10,000001,Vente,1,,,BOUSSOLE,B003,38200,38110,Chuzelles,38,,,381100000A3883,,,,,,,,,,,,,0,,,,,AB,terrains a bâtir,,,89,4.861126,45.567742
2020-571772,2020-12-22,000001,Vente,765000,,,PAUPHILE,B015,38200,38110,Chuzelles,38,,,381100000A3563,,,,,,,,,,,,,0,,,,,S,sols,,,72,4.863689,45.560527
2020-571772,2020-12-22,000001,Vente,765000,,,PAUPHILE,B015,38200,38110,Chuzelles,38,,,381100000A3661,,,,,,,,,,,,,0,,,,,AG,terrains d'agrément,,,11,4.864347,45.560827
2020-571772,2020-12-22,000001,Vente,765000,,,PAUPHILE,B015,38200,38110,Chuzelles,38,,,381100000A3664,,,,,,,,,,,,,0,,,,,S,sols,,,27,4.864096,45.560785
2020-571772,2020-12-22,000001,Vente,765000,,,PAUPHILE,B015,38200,38110,Chuzelles,38,,,381100000A3665,,,,,,,,,,,,,0,,,,,S,sols,,,32,4.863916,45.560638
2020-571772,2020-12-22,000001,Vente,765000,,,PAUPHILE,B015,38200,38110,Chuzelles,38,,,381100000A3666,,,,,,,,,,,,,0,,,,,S,sols,,,18,4.863843,45.56059
2020-571772,2020-12-22,000001,Vente,765000,5014,,PAUPHILE,B015,38200,38110,Chuzelles,38,,,381100000A3667,,,,,,,,,,,,,0,3,Dépendance,,0,S,sols,,,1000,4.864126,45.560595
2020-571772,2020-12-22,000001,Vente,765000,5014,,PAUPHILE,B015,38200,38110,Chuzelles,38,,,381100000A3667,,,,,,,,,,,,,0,1,Maison,170,4,AG,terrains d'agrément,,,1487,4.864126,45.560595
2020-571772,2020-12-22,000001,Vente,765000,5014,,PAUPHILE,B015,38200,38110,Chuzelles,38,,,381100000A3667,,,,,,,,,,,,,0,3,Dépendance,,0,AG,terrains d'agrément,,,1487,4.864126,45.560595
2020-571772,2020-12-22,000001,Vente,765000,5014,,PAUPHILE,B015,38200,38110,Chuzelles,38,,,381100000A3667,,,,,,,,,,,,,0,1,Maison,170,4,S,sols,,,1000,4.864126,45.560595
2020-571772,2020-12-22,000001,Vente,765000,,,PAUPHILE,B015,38200,38110,Chuzelles,38,,,381100000A3669,,,,,,,,,,,,,0,,,,,S,sols,,,105,4.86384,45.560547
2020-571883,2020-12-14,000001,Vente,350000,5484,,PAUPHILE,B015,38200,38110,Chuzelles,38,,,381100000A1874,,,,,,,,,,,,,0,1,Maison,93,4,P,prés,,,1500,4.862332,45.55931
2020-571883,2020-12-14,000001,Vente,350000,5484,,PAUPHILE,B015,38200,38110,Chuzelles,38,,,381100000A1874,,,,,,,,,,,,,0,1,Maison,93,4,S,sols,,,1000,4.862332,45.55931
2020-571883,2020-12-14,000001,Vente,350000,5484,,PAUPHILE,B015,38200,38110,Chuzelles,38,,,381100000A1874,,,,,,,,,,,,,0,1,Maison,93,4,VE,vergers,,,1060,4.862332,45.55931
2020-571883,2020-12-14,000001,Vente,350000,,,PAUPHILE,B015,38200,38110,Chuzelles,38,,,381100000A1877,,,,,,,,,,,,,0,,,,,S,sols,,,131,4.861621,45.558973
2020-572059,2020-12-24,000001,Vente,185000,364,,CHE DU ROYER,0330,38200,38110,Chuzelles,38,,,381100000A1695,,,,,,,,,,,,,0,1,Maison,57,3,S,sols,,,915,4.882543,45.5904
2020-572059,2020-12-24,000001,Vente,185000,364,,CHE DU ROYER,0330,38200,38110,Chuzelles,38,,,381100000A1695,,,,,,,,,,,,,0,1,Maison,57,3,T,terres,,,610,4.882543,45.5904
2020-572064,2020-12-18,000001,Vente,700,,,MONTFERRAT ET RECOUR,B014,38200,38110,Chuzelles,38,,,381100000A0220,,,,,,,,,,,,,0,,,,,T,terres,,,1840,4.873106,45.5898
