id_mutation,date_mutation,numero_disposition,nature_mutation,valeur_fonciere,adresse_numero,adresse_suffixe,adresse_nom_voie,adresse_code_voie,code_postal,code_commune,nom_commune,code_departement,ancien_code_commune,ancien_nom_commune,id_parcelle,ancien_id_parcelle,numero_volume,lot1_numero,lot1_surface_carrez,lot2_numero,lot2_surface_carrez,lot3_numero,lot3_surface_carrez,lot4_numero,lot4_surface_carrez,lot5_numero,lot5_surface_carrez,nombre_lots,code_type_local,type_local,surface_reelle_bati,nombre_pieces_principales,code_nature_culture,nature_culture,code_nature_culture_speciale,nature_culture_speciale,surface_terrain,longitude,latitude
2020-556906,2020-01-07,000001,Vente,1278,,,LES GRANDS BOIS,B061,38142,38237,Mizoën,38,,,382370000E0102,,,,,,,,,,,,,0,,,,,BT,taillis simples,,,757,6.158002,45.039315
2020-556906,2020-01-07,000001,Vente,1278,,,LES GRANDS BOIS,B061,38142,38237,Mizoën,38,,,382370000E0103,,,,,,,,,,,,,0,,,,,BT,taillis simples,,,521,6.158071,45.03903
2020-556907,2020-01-07,000001,Vente,1689,,,LES GRANDS BOIS,B061,38142,38237,Mizoën,38,,,382370000E0104,,,,,,,,,,,,,0,,,,,BT,taillis simples,,,65,6.155454,45.039529
2020-556907,2020-01-07,000001,Vente,1689,,,LES GRANDS BOIS,B061,38142,38237,Mizoën,38,,,382370000E0105,,,,,,,,,,,,,0,,,,,BT,taillis simples,,,1624,6.155422,45.038952
2020-557101,2020-01-24,000002,Vente,2746,,,ESSARGAUTIER DE LA,B050,38142,38237,Mizoën,38,,,382370000D1220,,,,,,,,,,,,,0,,,,,L,landes,PATUR,Pâture plantée,495,6.192029,45.03825
2020-557101,2020-01-24,000002,Vente,2746,,,ESSARGAUTIER DE LA,B050,38142,38237,Mizoën,38,,,382370000D1646,,,,,,,,,,,,,0,,,,,L,landes,PATUR,Pâture plantée,1573,6.191643,45.038234
2020-557101,2020-01-24,000002,Vente,2746,,,ESSARGAUTIER DE LA,B050,38142,38237,Mizoën,38,,,382370000D1648,,,,,,,,,,,,,0,,,,,L,landes,PATUR,Pâture plantée,598,6.191845,45.038471
2020-558335,2020-05-20,000001,Vente,165000,5042,,HAMEAU DES AYMES,B063,38142,38237,Mizoën,38,,,382370000B0917,,,,,,,,,,,,,0,1,Maison,151,5,P,prés,,,130,6.149506,45.047813
2020-558335,2020-05-20,000001,Vente,165000,,,HAMEAU DES AYMES,B063,38142,38237,Mizoën,38,,,382370000B1206,,,,,,,,,,,,,0,,,,,J,jardins,,,60,6.149621,45.047718
2020-558335,2020-05-20,000001,Vente,165000,,,HAMEAU DES AYMES,B063,38142,38237,Mizoën,38,,,382370000B1613,,,,,,,,,,,,,0,,,,,P,prés,,,526,6.149609,45.047824
2020-560245,2020-10-31,000001,Vente,154000,8,,GRAND'RUE,0950,38142,38237,Mizoën,38,,,38237000AB0659,,,4,,,,,,,,,,1,2,Appartement,56,3,,,,,,6.142704,45.049839
2020-560487,2020-11-09,000001,Vente,115000,273,,RTE D EMPARIS,0500,38142,38237,Mizoën,38,,,38237000AB0910,,,,,,,,,,,,,0,1,Maison,85,4,S,sols,,,277,6.143733,45.052391
2020-560685,2020-11-18,000001,Vente,1197,,,HAMEAU DU CLOT,B064,38142,38237,Mizoën,38,,,382370000D0373,,,,,,,,,,,,,0,,,,,S,sols,,,70,6.182907,45.043686
2020-560843,2020-11-16,000002,Vente,100,,,VILLAGE DE MIZOEN,B117,38142,38237,Mizoën,38,,,38237000AB0970,,,,,,,,,,,,,0,,,,,S,sols,,,12,6.142308,45.049648
2020-560875,2020-11-27,000001,Vente,1815,,,SERRE PELISSIER,B107,38142,38237,Mizoën,38,,,38237000AB0210,,,,,,,,,,,,,0,,,,,P,prés,,,355,6.143926,45.052608
2020-561271,2020-11-16,000001,Vente,1368,3,,GRAND'RUE,0950,38142,38237,Mizoën,38,,,38237000AB0972,,,,,,,,,,,,,0,,,,,S,sols,,,36,6.141829,45.049592
