id_mutation,date_mutation,numero_disposition,nature_mutation,valeur_fonciere,adresse_numero,adresse_suffixe,adresse_nom_voie,adresse_code_voie,code_postal,code_commune,nom_commune,code_departement,ancien_code_commune,ancien_nom_commune,id_parcelle,ancien_id_parcelle,numero_volume,lot1_numero,lot1_surface_carrez,lot2_numero,lot2_surface_carrez,lot3_numero,lot3_surface_carrez,lot4_numero,lot4_surface_carrez,lot5_numero,lot5_surface_carrez,nombre_lots,code_type_local,type_local,surface_reelle_bati,nombre_pieces_principales,code_nature_culture,nature_culture,code_nature_culture_speciale,nature_culture_speciale,surface_terrain,longitude,latitude
2020-572225,2020-01-06,000001,Vente,2100,,,LES ENCLOSES,B025,38210,38450,Saint-Quentin-sur-Isère,38,,,38450000AP0161,,,,,,,,,,,,,0,,,,,T,terres,,,2310,5.573357,45.292718
2020-572225,2020-01-06,000001,Vente,2100,,,LA FESSE,B029,38210,38450,Saint-Quentin-sur-Isère,38,,,38450000AT0040,,,,,,,,,,,,,0,,,,,BT,taillis simples,,,8700,5.588189,45.287672
2020-572225,2020-01-06,000001,Vente,2100,,,BALME CHORRIER,B001,38210,38450,Saint-Quentin-sur-Isère,38,,,38450000AV0014,,,,,,,,,,,,,0,,,,,BT,taillis simples,,,3070,5.56987,45.285572
2020-572227,2020-01-06,000001,Vente,2700,,,LE BAS DES ENCLOSES,B002,38210,38450,Saint-Quentin-sur-Isère,38,,,38450000AP0060,,,,,,,,,,,,,0,,,,,PA,pâtures,PATUR,Pâture plantée,1574,5.567114,45.29581
2020-572227,2020-01-06,000001,Vente,2700,,,LE BAS DES ENCLOSES,B002,38210,38450,Saint-Quentin-sur-Isère,38,,,38450000AP0061,,,,,,,,,,,,,0,,,,,P,prés,,,4711,5.568166,45.294928
2020-572227,2020-01-06,000001,Vente,2700,,,LES ENCLOSES,B025,38210,38450,Saint-Quentin-sur-Isère,38,,,38450000AP0161,,,,,,,,,,,,,0,,,,,T,terres,,,2310,5.573357,45.292718
2020-572227,2020-01-06,000001,Vente,2700,,,LA FESSE,B029,38210,38450,Saint-Quentin-sur-Isère,38,,,38450000AT0040,,,,,,,,,,,,,0,,,,,BT,taillis simples,,,8700,5.588189,45.287672
2020-572227,2020-01-06,000001,Vente,2700,,,BALME CHORRIER,B001,38210,38450,Saint-Quentin-sur-Isère,38,,,38450000AV0014,,,,,,,,,,,,,0,,,,,BT,taillis simples,,,3070,5.56987,45.285572
2020-572293,2020-01-22,000001,Vente,1200,,,LE BAS DES ENCLOSES,B002,38210,38450,Saint-Quentin-sur-Isère,38,,,38450000AP0060,,,,,,,,,,,,,0,,,,,PA,pâtures,PATUR,Pâture plantée,1574,5.567114,45.29581
2020-572293,2020-01-22,000001,Vente,1200,,,LE BAS DES ENCLOSES,B002,38210,38450,Saint-Quentin-sur-Isère,38,,,38450000AP0061,,,,,,,,,,,,,0,,,,,P,prés,,,4711,5.568166,45.294928
2020-572477,2020-02-20,000001,Vente,265000,291,,RTE DE GRENOBLE,0450,38210,38450,Saint-Quentin-sur-Isère,38,,,38450000AS0227,,,,,,,,,,,,,0,2,Appartement,30,1,S,sols,,,1422,5.542077,45.281499
2020-572477,2020-02-20,000001,Vente,265000,291,,RTE DE GRENOBLE,0450,38210,38450,Saint-Quentin-sur-Isère,38,,,38450000AS0227,,,,,,,,,,,,,0,2,Appartement,120,4,S,sols,,,1422,5.542077,45.281499
2020-572477,2020-02-20,000001,Vente,265000,,,SOUS LA ROCHE,B075,38210,38450,Saint-Quentin-sur-Isère,38,,,38450000AS0230,,,,,,,,,,,,,0,,,,,T,terres,,,302,5.541911,45.281423
2020-572547,2020-03-04,000001,Vente,5000,,,LE REPLAT,B067,38210,38450,Saint-Quentin-sur-Isère,38,,,38450000AP0239,,,,,,,,,,,,,0,,,,,P,prés,,,2620,5.57934,45.290132
2020-572584,2020-03-16,000001,Vente,4757,,,LES BRUGNIERES,B010,38210,38450,Saint-Quentin-sur-Isère,38,,,384500000D0010,,,,,,,,,,,,,0,,,,,BT,taillis simples,,,1230,5.519291,45.246966
2020-572584,2020-03-16,000001,Vente,4757,,,LES BRUGNIERES,B010,38210,38450,Saint-Quentin-sur-Isère,38,,,384500000D0027,,,,,,,,,,,,,0,,,,,BT,taillis simples,,,7940,5.52534,45.245878
2020-572675,2020-03-26,000001,Vente,930000,45,A,CHE DE LA BIOLE,0320,38210,38450,Saint-Quentin-sur-Isère,38,,,38450000AS0256,,,,,,,,,,,,,0,4,Local industriel. commercial ou assimilé,1058,0,S,sols,,,7200,5.536645,45.281884
2020-572675,2020-03-26,000001,Vente,930000,45,A,CHE DE LA BIOLE,0320,38210,38450,Saint-Quentin-sur-Isère,38,,,38450000AS0256,,,,,,,,,,,,,0,4,Local industriel. commercial ou assimilé,227,0,S,sols,,,7200,5.536645,45.281884
2020-572675,2020-03-26,000001,Vente,930000,45,A,CHE DE LA BIOLE,0320,38210,38450,Saint-Quentin-sur-Isère,38,,,38450000AS0256,,,,,,,,,,,,,0,4,Local industriel. commercial ou assimilé,140,0,S,sols,,,7200,5.536645,45.281884
2020-572767,2020-05-04,000001,Vente,37500,,,LA GRANDE GRANGE,B036,38210,38450,Saint-Quentin-sur-Isère,38,,,38450000AO0258,,,,,,,,,,,,,0,,,,,S,sols,,,2154,5.557726,45.286006
2020-572848,2020-05-18,000001,Vente,15000,,,LA GRANDE GRANGE,B036,38210,38450,Saint-Quentin-sur-Isère,38,,,38450000AO0260,,,,,,,,,,,,,0,,,,,S,sols,,,502,,
2020-572913,2020-06-03,000001,Vente,107900,,,LES TERRES,B078,38210,38450,Saint-Quentin-sur-Isère,38,,,38450000AL0649,,,,,,,,,,,,,0,,,,,AB,terrains a bâtir,,,957,5.551835,45.279922
2020-572913,2020-06-03,000001,Vente,107900,,,LES TERRES,B078,38210,38450,Saint-Quentin-sur-Isère,38,,,38450000AL0650,,,,,,,,,,,,,0,,,,,AB,terrains a bâtir,,,67,5.551753,45.28002
2020-573037,2020-06-26,000002,Vente,3200,,,ROMANETIERE,B068,38210,38450,Saint-Quentin-sur-Isère,38,,,38450000AI0502,,,,,,,,,,,,,0,,,,,T,terres,,,45,5.536412,45.277631
2020-573037,2020-06-26,000002,Vente,3200,,,ROMANETIERE,B068,38210,38450,Saint-Quentin-sur-Isère,38,,,38450000AI0507,,,,,,,,,,,,,0,,,,,AB,terrains a bâtir,,,19,5.536047,45.277627
2020-573057,2020-06-25,000001,Vente,253970,,,BEAUREGARD,B004,38210,38450,Saint-Quentin-sur-Isère,38,,,38450000AX0304,,,,,,,,,,,,,0,,,,,S,sols,,,1166,5.542328,45.278615
2020-573057,2020-06-25,000001,Vente,253970,,,BEAUREGARD,B004,38210,38450,Saint-Quentin-sur-Isère,38,,,38450000AX0305,,,,,,,,,,,,,0,,,,,S,sols,,,78,5.541429,45.278952
2020-573057,2020-06-25,000001,Vente,253970,,,BEAUREGARD,B004,38210,38450,Saint-Quentin-sur-Isère,38,,,38450000AX0306,,,,,,,,,,,,,0,,,,,S,sols,,,55,5.543525,45.277879
2020-573057,2020-06-25,000001,Vente,253970,,,BEAUREGARD,B004,38210,38450,Saint-Quentin-sur-Isère,38,,,38450000AX0307,,,,,,,,,,,,,0,,,,,S,sols,,,94,5.543183,45.278045
2020-573057,2020-06-25,000001,Vente,253970,,,BEAUREGARD,B004,38210,38450,Saint-Quentin-sur-Isère,38,,,38450000AX0308,,,,,,,,,,,,,0,,,,,S,sols,,,53,5.542305,45.278959
2020-573057,2020-06-25,000001,Vente,253970,,,BEAUREGARD,B004,38210,38450,Saint-Quentin-sur-Isère,38,,,38450000AX0310,,,,,,,,,,,,,0,,,,,P,prés,,,29,5.542817,45.278289
2020-573057,2020-06-25,000001,Vente,253970,,,BEAUREGARD,B004,38210,38450,Saint-Quentin-sur-Isère,38,,,38450000AX0311,,,,,,,,,,,,,0,,,,,S,sols,,,21,5.543631,45.277844
2020-573057,2020-06-25,000001,Vente,253970,,,BEAUREGARD,B004,38210,38450,Saint-Quentin-sur-Isère,38,,,38450000AX0312,,,,,,,,,,,,,0,,,,,S,sols,,,61,5.543516,45.27777
2020-573057,2020-06-25,000001,Vente,253970,9,B,RUE DU VERCORS,0100,38210,38450,Saint-Quentin-sur-Isère,38,,,38450000AX0378,,,,,,,,,,,,,0,1,Maison,82,4,S,sols,,,401,5.542086,45.27875
2020-573057,2020-06-25,000001,Vente,253970,,,BEAUREGARD,B004,38210,38450,Saint-Quentin-sur-Isère,38,,,38450000AX0386,,,,,,,,,,,,,0,,,,,S,sols,,,94,5.542462,45.278469
2020-573145,2020-07-15,000002,Vente,200,,,LE BOURG,B009,38210,38450,Saint-Quentin-sur-Isère,38,,,38450000AL0663,,,,,,,,,,,,,0,,,,,S,sols,,,7,5.547851,45.281942
2020-573182,2020-06-24,000001,Vente,35586,,,LES OVES DE RENAUDIERE,B061,38210,38450,Saint-Quentin-sur-Isère,38,,,38450000AD0160,,,,,,,,,,,,,0,,,,,BP,peupleraies,,,2878,5.523461,45.262702
2020-573182,2020-06-24,000001,Vente,35586,,,LES OVES DE RENAUDIERE,B061,38210,38450,Saint-Quentin-sur-Isère,38,,,38450000AD0161,,,,,,,,,,,,,0,,,,,BP,peupleraies,,,1945,5.524095,45.262365
2020-573182,2020-06-24,000001,Vente,35586,,,LES OVES DE RENAUDIERE,B061,38210,38450,Saint-Quentin-sur-Isère,38,,,38450000AD0163,,,,,,,,,,,,,0,,,,,BP,peupleraies,,,7972,5.520394,45.262855
2020-573182,2020-06-24,000001,Vente,35586,,,LES OVES DE RENAUDIERE,B061,38210,38450,Saint-Quentin-sur-Isère,38,,,38450000AD0168,,,,,,,,,,,,,0,,,,,BP,peupleraies,,,34593,5.522802,45.262438
2020-573182,2020-06-24,000001,Vente,35586,,,MAS DE L ELLIOU,B056,38210,38450,Saint-Quentin-sur-Isère,38,,,38450000AH0077,,,,,,,,,,,,,0,,,,,T,terres,,,12709,5.527373,45.272188
2020-573182,2020-06-24,000001,Vente,35586,,,MAS DE L ELLIOU,B056,38210,38450,Saint-Quentin-sur-Isère,38,,,38450000AH0077,,,,,,,,,,,,,0,,,,,T,terres,,,6355,5.527373,45.272188
2020-573182,2020-06-24,000001,Vente,35586,,,MAS DE L ELLIOU,B056,38210,38450,Saint-Quentin-sur-Isère,38,,,38450000AH0080,,,,,,,,,,,,,0,,,,,T,terres,,,9155,5.52794,45.270489
2020-573182,2020-06-24,000001,Vente,35586,,,MAS DE L ELLIOU,B056,38210,38450,Saint-Quentin-sur-Isère,38,,,38450000AH0080,,,,,,,,,,,,,0,,,,,T,terres,,,9155,5.52794,45.270489
2020-573282,2020-07-15,000001,Vente,20000,,,LE BOURG,B009,38210,38450,Saint-Quentin-sur-Isère,38,,,38450000AL0031,,,,,,,,,,,,,0,,,,,S,sols,,,35,5.547817,45.281909
2020-573282,2020-07-15,000001,Vente,20000,,,LE BOURG,B009,38210,38450,Saint-Quentin-sur-Isère,38,,,38450000AL0663,,,,,,,,,,,,,0,,,,,S,sols,,,7,5.547851,45.281942
2020-573386,2020-09-01,000001,Vente,20000,,,FEROULIERE LE HAUT,B027,38210,38450,Saint-Quentin-sur-Isère,38,,,38450000AX0427,,,,,,,,,,,,,0,,,,,AB,terrains a bâtir,,,321,5.541784,45.277027
2020-573405,2020-09-03,000001,Vente,1500,,,MATISSOLE,B058,38210,38450,Saint-Quentin-sur-Isère,38,,,38450000AI0015,,,,,,,,,,,,,0,,,,,T,terres,,,3728,5.530008,45.282104
2020-573405,2020-09-03,000001,Vente,1500,,,MATISSOLE,B058,38210,38450,Saint-Quentin-sur-Isère,38,,,38450000AI0015,,,,,,,,,,,,,0,,,,,T,terres,,,1865,5.530008,45.282104
2020-573405,2020-09-03,000001,Vente,1500,,,MATISSOLE,B058,38210,38450,Saint-Quentin-sur-Isère,38,,,38450000AI0017,,,,,,,,,,,,,0,,,,,T,terres,,,1748,5.5305,45.282457
2020-573461,2020-09-17,000001,Vente,10000,,,LA TERRASSE,B077,38210,38450,Saint-Quentin-sur-Isère,38,,,38450000AK0028,,,,,,,,,,,,,0,,,,,VE,vergers,NOYER,Noyeraie ou noyers,7495,5.537462,45.272375
2020-573485,2020-09-14,000001,Vente,269200,,,LE GOURET,B035,38210,38450,Saint-Quentin-sur-Isère,38,,,38450000AH0551,,,,,,,,,,,,,0,,,,,BT,taillis simples,,,2,5.534366,45.270536
2020-573485,2020-09-14,000001,Vente,269200,,,LE GOURET,B035,38210,38450,Saint-Quentin-sur-Isère,38,,,38450000AH0595,,,,,,,,,,,,,0,,,,,BP,peupleraies,,,1592,5.534624,45.270517
2020-573485,2020-09-14,000001,Vente,269200,216,,RUE DE LA PIERRE AIGUE,0200,38210,38450,Saint-Quentin-sur-Isère,38,,,38450000AH0601,,,,,,,,,,,,,0,3,Dépendance,,0,P,prés,,,1119,5.535168,45.270815
2020-573485,2020-09-14,000001,Vente,269200,216,,RUE DE LA PIERRE AIGUE,0200,38210,38450,Saint-Quentin-sur-Isère,38,,,38450000AH0601,,,,,,,,,,,,,0,1,Maison,100,4,S,sols,,,1000,5.535168,45.270815
2020-573485,2020-09-14,000001,Vente,269200,216,,RUE DE LA PIERRE AIGUE,0200,38210,38450,Saint-Quentin-sur-Isère,38,,,38450000AH0601,,,,,,,,,,,,,0,3,Dépendance,,0,S,sols,,,1000,5.535168,45.270815
2020-573485,2020-09-14,000001,Vente,269200,216,,RUE DE LA PIERRE AIGUE,0200,38210,38450,Saint-Quentin-sur-Isère,38,,,38450000AH0601,,,,,,,,,,,,,0,3,Dépendance,,0,S,sols,,,1000,5.535168,45.270815
2020-573485,2020-09-14,000001,Vente,269200,216,,RUE DE LA PIERRE AIGUE,0200,38210,38450,Saint-Quentin-sur-Isère,38,,,38450000AH0601,,,,,,,,,,,,,0,1,Maison,100,4,P,prés,,,1119,5.535168,45.270815
2020-573485,2020-09-14,000001,Vente,269200,216,,RUE DE LA PIERRE AIGUE,0200,38210,38450,Saint-Quentin-sur-Isère,38,,,38450000AH0601,,,,,,,,,,,,,0,3,Dépendance,,0,P,prés,,,1119,5.535168,45.270815
2020-573519,2020-09-23,000001,Vente,126140,,,LE GOURET,B035,38210,38450,Saint-Quentin-sur-Isère,38,,,38450000AH0512,,,,,,,,,,,,,0,,,,,T,terres,,,4105,5.533087,45.271042
2020-573519,2020-09-23,000001,Vente,126140,,,LE GOURET,B035,38210,38450,Saint-Quentin-sur-Isère,38,,,38450000AH0517,,,,,,,,,,,,,0,,,,,T,terres,,,38,5.533883,45.27083
2020-573519,2020-09-23,000001,Vente,126140,,,LE GOURET,B035,38210,38450,Saint-Quentin-sur-Isère,38,,,38450000AH0519,,,,,,,,,,,,,0,,,,,T,terres,,,38,5.533911,45.27089
2020-573519,2020-09-23,000001,Vente,126140,,,LE GOURET,B035,38210,38450,Saint-Quentin-sur-Isère,38,,,38450000AH0523,,,,,,,,,,,,,0,,,,,T,terres,,,2075,5.534197,45.270881
2020-573519,2020-09-23,000001,Vente,126140,,,LE GOURET,B035,38210,38450,Saint-Quentin-sur-Isère,38,,,38450000AH0525,,,,,,,,,,,,,0,,,,,PA,pâtures,PATUR,Pâture plantée,51,5.532714,45.271052
2020-573605,2020-09-29,000001,Vente,40000,,,LE BOURG,B009,38210,38450,Saint-Quentin-sur-Isère,38,,,38450000AL0293,,,,,,,,,,,,,0,,,,,S,sols,,,379,5.548117,45.281981
2020-573605,2020-09-29,000001,Vente,40000,906,,RUE DU VERCORS,0100,38210,38450,Saint-Quentin-sur-Isère,38,,,38450000AL0298,,,2,87.27,,,,,,,,,1,2,Appartement,73,4,,,,,,5.548242,45.282145
2020-573683,2020-10-09,000001,Vente,317600,216,C,CHE DU STADE,0340,38210,38450,Saint-Quentin-sur-Isère,38,,,38450000AW0251,,,,,,,,,,,,,0,1,Maison,109,5,S,sols,,,534,5.550327,45.277742
2020-573683,2020-10-09,000001,Vente,317600,,,HAMEAU DU GIT,B041,38210,38450,Saint-Quentin-sur-Isère,38,,,38450000AW0282,,,,,,,,,,,,,0,,,,,S,sols,,,183,5.550588,45.27786
2020-573806,2020-10-27,000001,Vente,,,,L ILE BARRE,B044,38210,38450,Saint-Quentin-sur-Isère,38,,,38450000AM0267,,,,,,,,,,,,,0,,,,,BT,taillis simples,,,17594,5.537653,45.293755
2020-573806,2020-10-27,000001,Vente,,,,L ILE BARRE,B044,38210,38450,Saint-Quentin-sur-Isère,38,,,38450000AM0269,,,,,,,,,,,,,0,,,,,BT,taillis simples,,,69038,5.536991,45.292272
2020-573806,2020-10-27,000001,Vente,,,,L ILE BARRE,B044,38210,38450,Saint-Quentin-sur-Isère,38,,,38450000AM0271,,,,,,,,,,,,,0,,,,,BT,taillis simples,,,13692,5.531717,45.291695
2020-574037,2020-11-25,000001,Vente,221000,241,,RUE DES SOURCES,0095,38210,38450,Saint-Quentin-sur-Isère,38,,,38450000AP0210,,,,,,,,,,,,,0,1,Maison,68,3,S,sols,,,301,5.58078,45.292138
2020-574037,2020-11-25,000001,Vente,221000,,,LE REPLAT,B067,38210,38450,Saint-Quentin-sur-Isère,38,,,38450000AP0432,,,,,,,,,,,,,0,,,,,S,sols,,,500,5.58037,45.292199
2020-574037,2020-11-25,000001,Vente,221000,,,LE REPLAT,B067,38210,38450,Saint-Quentin-sur-Isère,38,,,38450000AP0434,,,,,,,,,,,,,0,,,,,S,sols,,,75,5.580596,45.292326
2020-574305,2020-12-28,000001,Vente,60000,,,LE BAS DES ENCLOSES,B002,38210,38450,Saint-Quentin-sur-Isère,38,,,38450000AP0007,,,,,,,,,,,,,0,,,,,T,terres,,,6288,5.562439,45.294235
2020-574305,2020-12-28,000001,Vente,60000,,,LE BAS DES ENCLOSES,B002,38210,38450,Saint-Quentin-sur-Isère,38,,,38450000AP0007,,,,,,,,,,,,,0,,,,,T,terres,,,3145,5.562439,45.294235
2020-574305,2020-12-28,000001,Vente,60000,,,LE BAS DES ENCLOSES,B002,38210,38450,Saint-Quentin-sur-Isère,38,,,38450000AP0011,,,,,,,,,,,,,0,,,,,T,terres,,,2137,5.564596,45.292539
2020-574305,2020-12-28,000001,Vente,60000,,,LE BAS DES ENCLOSES,B002,38210,38450,Saint-Quentin-sur-Isère,38,,,38450000AP0012,,,,,,,,,,,,,0,,,,,T,terres,,,2569,5.565256,45.292976
2020-574305,2020-12-28,000001,Vente,60000,,,LE BAS DES ENCLOSES,B002,38210,38450,Saint-Quentin-sur-Isère,38,,,38450000AP0013,,,,,,,,,,,,,0,,,,,BT,taillis simples,,,2094,5.565028,45.293208
2020-574305,2020-12-28,000001,Vente,60000,,,LE BAS DES ENCLOSES,B002,38210,38450,Saint-Quentin-sur-Isère,38,,,38450000AP0014,,,,,,,,,,,,,0,,,,,BT,taillis simples,,,458,5.564708,45.293374
2020-574305,2020-12-28,000001,Vente,60000,,,LE BAS DES ENCLOSES,B002,38210,38450,Saint-Quentin-sur-Isère,38,,,38450000AP0015,,,,,,,,,,,,,0,,,,,BP,peupleraies,,,567,5.56467,45.293401
2020-574305,2020-12-28,000001,Vente,60000,,,LE BAS DES ENCLOSES,B002,38210,38450,Saint-Quentin-sur-Isère,38,,,38450000AP0016,,,,,,,,,,,,,0,,,,,BP,peupleraies,,,2519,5.564297,45.293541
2020-574305,2020-12-28,000001,Vente,60000,,,LE BAS DES ENCLOSES,B002,38210,38450,Saint-Quentin-sur-Isère,38,,,38450000AP0017,,,,,,,,,,,,,0,,,,,BP,peupleraies,,,834,5.564137,45.293798
2020-574305,2020-12-28,000001,Vente,60000,,,LE BAS DES ENCLOSES,B002,38210,38450,Saint-Quentin-sur-Isère,38,,,38450000AP0018,,,,,,,,,,,,,0,,,,,S,sols,,,32,5.56376,45.293745
2020-574305,2020-12-28,000001,Vente,60000,,,LE BAS DES ENCLOSES,B002,38210,38450,Saint-Quentin-sur-Isère,38,,,38450000AP0019,,,,,,,,,,,,,0,,,,,BT,taillis simples,,,1880,5.563933,45.29382
2020-574305,2020-12-28,000001,Vente,60000,,,LE BAS DES ENCLOSES,B002,38210,38450,Saint-Quentin-sur-Isère,38,,,38450000AP0020,,,,,,,,,,,,,0,,,,,T,terres,,,6858,5.562994,45.294553
2020-574305,2020-12-28,000001,Vente,60000,,,LE BAS DES ENCLOSES,B002,38210,38450,Saint-Quentin-sur-Isère,38,,,38450000AP0020,,,,,,,,,,,,,0,,,,,T,terres,,,3430,5.562994,45.294553
2020-574305,2020-12-28,000001,Vente,60000,,,LE BAS DES ENCLOSES,B002,38210,38450,Saint-Quentin-sur-Isère,38,,,38450000AP0023,,,,,,,,,,,,,0,,,,,T,terres,,,5613,5.563536,45.295084
2020-574305,2020-12-28,000001,Vente,60000,,,LE BAS DES ENCLOSES,B002,38210,38450,Saint-Quentin-sur-Isère,38,,,38450000AP0023,,,,,,,,,,,,,0,,,,,T,terres,,,2807,5.563536,45.295084
2020-574305,2020-12-28,000001,Vente,60000,,,LE BAS DES ENCLOSES,B002,38210,38450,Saint-Quentin-sur-Isère,38,,,38450000AP0024,,,,,,,,,,,,,0,,,,,BP,peupleraies,,,555,5.56437,45.294416
2020-574305,2020-12-28,000001,Vente,60000,,,LE BAS DES ENCLOSES,B002,38210,38450,Saint-Quentin-sur-Isère,38,,,38450000AP0025,,,,,,,,,,,,,0,,,,,BP,peupleraies,,,2140,5.564541,45.29436
2020-574305,2020-12-28,000001,Vente,60000,,,LE BAS DES ENCLOSES,B002,38210,38450,Saint-Quentin-sur-Isère,38,,,38450000AP0026,,,,,,,,,,,,,0,,,,,BP,peupleraies,,,1695,5.564742,45.294271
2020-574305,2020-12-28,000001,Vente,60000,,,LE BAS DES ENCLOSES,B002,38210,38450,Saint-Quentin-sur-Isère,38,,,38450000AP0027,,,,,,,,,,,,,0,,,,,BT,taillis simples,,,359,5.564991,45.294023
2020-574305,2020-12-28,000001,Vente,60000,,,LE BAS DES ENCLOSES,B002,38210,38450,Saint-Quentin-sur-Isère,38,,,38450000AP0028,,,,,,,,,,,,,0,,,,,BT,taillis simples,,,766,5.565069,45.293924
2020-574305,2020-12-28,000001,Vente,60000,,,LE BAS DES ENCLOSES,B002,38210,38450,Saint-Quentin-sur-Isère,38,,,38450000AP0029,,,,,,,,,,,,,0,,,,,BT,taillis simples,,,1615,5.565391,45.293538
2020-574305,2020-12-28,000001,Vente,60000,,,LE BAS DES ENCLOSES,B002,38210,38450,Saint-Quentin-sur-Isère,38,,,38450000AP0029,,,,,,,,,,,,,0,,,,,T,terres,,,3276,5.565391,45.293538
2020-574305,2020-12-28,000001,Vente,60000,,,LE BAS DES ENCLOSES,B002,38210,38450,Saint-Quentin-sur-Isère,38,,,38450000AP0030,,,,,,,,,,,,,0,,,,,T,terres,,,1495,5.565756,45.293167
2020-574305,2020-12-28,000001,Vente,60000,,,LE BAS DES ENCLOSES,B002,38210,38450,Saint-Quentin-sur-Isère,38,,,38450000AP0503,,,,,,,,,,,,,0,,,,,BT,taillis simples,,,2150,5.561447,45.294427
2020-574305,2020-12-28,000001,Vente,60000,,,LE BAS DES ENCLOSES,B002,38210,38450,Saint-Quentin-sur-Isère,38,,,38450000AP0504,,,,,,,,,,,,,0,,,,,BT,taillis simples,,,2001,5.56229,45.29403
2020-574305,2020-12-28,000001,Vente,60000,,,LE BAS DES ENCLOSES,B002,38210,38450,Saint-Quentin-sur-Isère,38,,,38450000AP0505,,,,,,,,,,,,,0,,,,,BP,peupleraies,,,2242,5.562293,45.295144
2020-574305,2020-12-28,000001,Vente,60000,,,LE BAS DES ENCLOSES,B002,38210,38450,Saint-Quentin-sur-Isère,38,,,38450000AP0506,,,,,,,,,,,,,0,,,,,BP,peupleraies,,,1219,5.562507,45.294963
2020-574305,2020-12-28,000001,Vente,60000,,,LE BAS DES ENCLOSES,B002,38210,38450,Saint-Quentin-sur-Isère,38,,,38450000AP0507,,,,,,,,,,,,,0,,,,,BP,peupleraies,,,2226,5.562978,45.295633
2020-574305,2020-12-28,000001,Vente,60000,,,LE BAS DES ENCLOSES,B002,38210,38450,Saint-Quentin-sur-Isère,38,,,38450000AP0508,,,,,,,,,,,,,0,,,,,T,terres,,,2107,5.563077,45.295424
2020-574306,2020-12-30,000001,Vente,16000,,,SOUS GILBRATAR,B074,38210,38450,Saint-Quentin-sur-Isère,38,,,38450000AM0140,,,,,,,,,,,,,0,,,,,T,terres,,,5452,5.548998,45.285802
2020-574306,2020-12-30,000001,Vente,16000,,,SOUS GILBRATAR,B074,38210,38450,Saint-Quentin-sur-Isère,38,,,38450000AM0142,,,,,,,,,,,,,0,,,,,T,terres,,,6455,5.548212,45.285993
2020-574306,2020-12-30,000001,Vente,16000,,,SOUS GILBRATAR,B074,38210,38450,Saint-Quentin-sur-Isère,38,,,38450000AM0156,,,,,,,,,,,,,0,,,,,T,terres,,,1142,5.548943,45.286035
2020-574306,2020-12-30,000001,Vente,16000,,,LE BAS DES ENCLOSES,B002,38210,38450,Saint-Quentin-sur-Isère,38,,,38450000AP0050,,,,,,,,,,,,,0,,,,,E,eaux,ETANG,Etangs,1726,5.565047,45.295727
2020-574306,2020-12-30,000001,Vente,16000,,,LE BAS DES ENCLOSES,B002,38210,38450,Saint-Quentin-sur-Isère,38,,,38450000AP0050,,,,,,,,,,,,,0,,,,,BT,taillis simples,,,5048,5.565047,45.295727
2020-574308,2020-12-28,000001,Vente,10000,,,LA GRANDE GRANGE,B036,38210,38450,Saint-Quentin-sur-Isère,38,,,38450000AO0278,,,,,,,,,,,,,0,,,,,T,terres,,,1159,5.561033,45.28757
2020-574308,2020-12-28,000001,Vente,10000,,,DELPHINIERE,B020,38210,38450,Saint-Quentin-sur-Isère,38,,,38450000AO0288,,,,,,,,,,,,,0,,,,,T,terres,,,1809,5.561751,45.287688
2020-574309,2020-12-28,000002,Vente,250000,2137,A,RTE DE GRENOBLE,0450,38210,38450,Saint-Quentin-sur-Isère,38,,,38450000AO0170,,,,,,,,,,,,,0,2,Appartement,75,4,AG,terrains d'agrément,PARC,Parc,866,5.562183,45.287872
2020-574309,2020-12-28,000002,Vente,250000,2137,A,RTE DE GRENOBLE,0450,38210,38450,Saint-Quentin-sur-Isère,38,,,38450000AO0170,,,,,,,,,,,,,0,3,Dépendance,,0,AG,terrains d'agrément,PARC,Parc,866,5.562183,45.287872
2020-574309,2020-12-28,000002,Vente,250000,2137,A,RTE DE GRENOBLE,0450,38210,38450,Saint-Quentin-sur-Isère,38,,,38450000AO0170,,,,,,,,,,,,,0,2,Appartement,131,5,AG,terrains d'agrément,PARC,Parc,866,5.562183,45.287872
2020-574309,2020-12-28,000002,Vente,250000,2137,A,RTE DE GRENOBLE,0450,38210,38450,Saint-Quentin-sur-Isère,38,,,38450000AO0170,,,,,,,,,,,,,0,3,Dépendance,,0,S,sols,,,1134,5.562183,45.287872
2020-574309,2020-12-28,000002,Vente,250000,2137,A,RTE DE GRENOBLE,0450,38210,38450,Saint-Quentin-sur-Isère,38,,,38450000AO0170,,,,,,,,,,,,,0,2,Appartement,131,5,S,sols,,,1134,5.562183,45.287872
2020-574309,2020-12-28,000002,Vente,250000,2137,A,RTE DE GRENOBLE,0450,38210,38450,Saint-Quentin-sur-Isère,38,,,38450000AO0170,,,,,,,,,,,,,0,2,Appartement,75,4,S,sols,,,1134,5.562183,45.287872
2020-574309,2020-12-28,000002,Vente,250000,,,DELPHINIERE,B020,38210,38450,Saint-Quentin-sur-Isère,38,,,38450000AO0289,,,,,,,,,,,,,0,,,,,T,terres,,,748,5.562021,45.287773
2020-574309,2020-12-28,000002,Vente,250000,,,DELPHINIERE,B020,38210,38450,Saint-Quentin-sur-Isère,38,,,38450000AO0293,,,,,,,,,,,,,0,,,,,J,jardins,PEPIN,Pépinières,936,5.562686,45.287916
