id_mutation,date_mutation,numero_disposition,nature_mutation,valeur_fonciere,adresse_numero,adresse_suffixe,adresse_nom_voie,adresse_code_voie,code_postal,code_commune,nom_commune,code_departement,ancien_code_commune,ancien_nom_commune,id_parcelle,ancien_id_parcelle,numero_volume,lot1_numero,lot1_surface_carrez,lot2_numero,lot2_surface_carrez,lot3_numero,lot3_surface_carrez,lot4_numero,lot4_surface_carrez,lot5_numero,lot5_surface_carrez,nombre_lots,code_type_local,type_local,surface_reelle_bati,nombre_pieces_principales,code_nature_culture,nature_culture,code_nature_culture_speciale,nature_culture_speciale,surface_terrain,longitude,latitude
2020-574371,2020-01-08,000001,Vente,30000,28,,RUE DE L'ECOLE,0010,39270,39045,Beffia,39,,,390450000B0100,,,,,,,,,,,,,0,1,Maison,145,3,S,sols,,,220,5.547543,46.525096
2020-574371,2020-01-08,000001,Vente,30000,,,AU VILLAGE,B068,39270,39045,Beffia,39,,,390450000B1117,,,,,,,,,,,,,0,,,,,S,sols,,,112,5.547373,46.52513
2020-574371,2020-01-08,000001,Vente,30000,,,AU VILLAGE,B068,39270,39045,Beffia,39,,,390450000B1118,,,,,,,,,,,,,0,,,,,J,jardins,POTAG,Jardin potager,86,5.547103,46.525019
2020-574371,2020-01-08,000001,Vente,30000,,,AU VILLAGE,B068,39270,39045,Beffia,39,,,390450000B1120,,,,,,,,,,,,,0,,,,,J,jardins,POTAG,Jardin potager,449,5.547238,46.525095
2020-578572,2020-09-25,000001,Vente,275000,,,AU VILLAGE,B068,39270,39045,Beffia,39,,,390450000B0882,,,,,,,,,,,,,0,,,,,J,jardins,POTAG,Jardin potager,800,,
2020-578572,2020-09-25,000001,Vente,275000,13,,RUE PELLAPUSSIN,0030,39270,39045,Beffia,39,,,390450000B0895,,,,,,,,,,,,,0,1,Maison,189,5,S,sols,,,750,5.54611,46.52677
2020-578572,2020-09-25,000001,Vente,275000,,,AU VILLAGE,B068,39270,39045,Beffia,39,,,390450000B1186,,,,,,,,,,,,,0,,,,,P,prés,,,362,5.546299,46.527077
2020-578572,2020-09-25,000001,Vente,275000,,,AU VILLAGE,B068,39270,39045,Beffia,39,,,390450000B1188,,,,,,,,,,,,,0,,,,,J,jardins,POTAG,Jardin potager,529,5.54608,46.527083
2020-578572,2020-09-25,000001,Vente,275000,,,AU VILLAGE,B068,39270,39045,Beffia,39,,,390450000B1190,,,,,,,,,,,,,0,,,,,T,terres,,,262,5.545843,46.527012
2020-579023,2020-10-15,000001,Vente,300,,,COTE PELLAPUSSIN,B019,39270,39045,Beffia,39,,,390450000A0722,,,,,,,,,,,,,0,,,,,PA,pâtures,,,4610,5.545836,46.533227
2020-579023,2020-10-15,000001,Vente,300,,,SOUS LA COTE,B058,39270,39045,Beffia,39,,,390450000B0869,,,,,,,,,,,,,0,,,,,PA,pâtures,,,2550,5.544046,46.524315
2020-579951,2020-12-03,000001,Vente,34000,,,AUX TEPPES,B065,39270,39045,Beffia,39,,,39045000ZA0003,,,,,,,,,,,,,0,,,,,T,terres,,,5540,5.555792,46.545707
