id_mutation,date_mutation,numero_disposition,nature_mutation,valeur_fonciere,adresse_numero,adresse_suffixe,adresse_nom_voie,adresse_code_voie,code_postal,code_commune,nom_commune,code_departement,ancien_code_commune,ancien_nom_commune,id_parcelle,ancien_id_parcelle,numero_volume,lot1_numero,lot1_surface_carrez,lot2_numero,lot2_surface_carrez,lot3_numero,lot3_surface_carrez,lot4_numero,lot4_surface_carrez,lot5_numero,lot5_surface_carrez,nombre_lots,code_type_local,type_local,surface_reelle_bati,nombre_pieces_principales,code_nature_culture,nature_culture,code_nature_culture_speciale,nature_culture_speciale,surface_terrain,longitude,latitude
2020-574708,2020-01-23,000002,Vente,70000,,,SUR LES MUES,B025,39570,39250,Geruge,39,,,39250000AA0089,,,,,,,,,,,,,0,,,,,S,sols,,,2279,5.531213,46.632284
2020-574815,2020-02-04,000001,Vente,4149.18,,,SOUS LA COTE DE VAUX,B027,39570,39250,Geruge,39,,,392500000B0078,,,,,,,,,,,,,0,,,,,T,terres,,,5828,5.538235,46.634989
2020-574815,2020-02-04,000001,Vente,4149.18,,,COMBE BASSE,B010,39570,39250,Geruge,39,,,392500000B0120,,,,,,,,,,,,,0,,,,,T,terres,,,6965,5.532089,46.627488
2020-574815,2020-02-04,000001,Vente,4149.18,,,CHAMPS DU BOIS,B007,39570,39250,Geruge,39,,,392500000C0038,,,,,,,,,,,,,0,,,,,P,prés,,,1551,5.533125,46.62154
2020-574815,2020-02-04,000001,Vente,4149.18,,,EN BIEF,B002,39570,39250,Geruge,39,,,392500000C0089,,,,,,,,,,,,,0,,,,,P,prés,,,4250,5.534433,46.616317
2020-574815,2020-02-04,000001,Vente,4149.18,,,EN GRAVELLE,B021,39570,39250,Geruge,39,,,392500000E0137,,,,,,,,,,,,,0,,,,,T,terres,,,4457,5.530422,46.634449
2020-575329,2020-03-06,000001,Echange,50,,,A LA FIN,B019,39570,39250,Geruge,39,,,39250000AA0084,,,,,,,,,,,,,0,,,,,S,sols,,,34,5.528775,46.63095
2020-575329,2020-03-06,000002,Echange,50,,,A LA FIN,B019,39570,39250,Geruge,39,,,39250000AA0083,,,,,,,,,,,,,0,,,,,S,sols,,,39,5.528923,46.631038
2020-575573,2020-03-14,000001,Vente,295605,351,,RTE DE MONTORIENT,0060,39570,39250,Geruge,39,,,39250000AA0006,,,,,,,,,,,,,0,1,Maison,120,6,S,sols,,,1566,5.528534,46.631062
2020-575573,2020-03-14,000001,Vente,295605,,,A LA FIN,B019,39570,39250,Geruge,39,,,39250000AA0083,,,,,,,,,,,,,0,,,,,S,sols,,,39,5.528923,46.631038
2020-575986,2020-05-13,000001,Vente,144000,,,AU VILLAGE,B029,39570,39250,Geruge,39,,,39250000AB0037,,,,,,,,,,,,,0,,,,,S,sols,,,103,5.530678,46.625972
2020-575986,2020-05-13,000001,Vente,144000,78,,CHE DE LA GRANGE ROUGE,0040,39570,39250,Geruge,39,,,39250000AB0038,,,,,,,,,,,,,0,1,Maison,120,4,S,sols,,,666,5.530529,46.62608
2020-576923,2020-06-22,000001,Vente,4500,,,COMBE DE VAUX,B012,39570,39250,Geruge,39,,,392500000B0188,,,,,,,,,,,,,0,,,,,P,prés,,,2831,5.534391,46.625841
2020-576923,2020-06-22,000001,Vente,4500,,,COMBE DE VAUX,B012,39570,39250,Geruge,39,,,392500000B0188,,,,,,,,,,,,,0,,,,,P,prés,,,8494,5.534391,46.625841
2020-577258,2020-07-01,000001,Vente,30000,,,SUR LES MUES,B025,39570,39250,Geruge,39,,,39250000AA0090,,,,,,,,,,,,,0,,,,,T,terres,,,1231,5.528704,46.631968
2020-578345,2020-08-28,000001,Vente,125000,62,,CHE DE LA GRANGE ROUGE,0040,39570,39250,Geruge,39,,,39250000AB0035,,,,,,,,,,,,,0,3,Dépendance,,0,S,sols,,,253,5.530597,46.626198
2020-578345,2020-08-28,000001,Vente,125000,62,,CHE DE LA GRANGE ROUGE,0040,39570,39250,Geruge,39,,,39250000AB0035,,,,,,,,,,,,,0,2,Appartement,39,1,S,sols,,,253,5.530597,46.626198
2020-578345,2020-08-28,000001,Vente,125000,62,,CHE DE LA GRANGE ROUGE,0040,39570,39250,Geruge,39,,,39250000AB0035,,,,,,,,,,,,,0,2,Appartement,49,2,S,sols,,,253,5.530597,46.626198
2020-578345,2020-08-28,000001,Vente,125000,62,,CHE DE LA GRANGE ROUGE,0040,39570,39250,Geruge,39,,,39250000AB0035,,,,,,,,,,,,,0,2,Appartement,53,2,S,sols,,,253,5.530597,46.626198
2020-578345,2020-08-28,000001,Vente,125000,62,,CHE DE LA GRANGE ROUGE,0040,39570,39250,Geruge,39,,,39250000AB0035,,,,,,,,,,,,,0,3,Dépendance,,0,S,sols,,,253,5.530597,46.626198
2020-578345,2020-08-28,000001,Vente,125000,,,AU VILLAGE,B029,39570,39250,Geruge,39,,,39250000AB0036,,,,,,,,,,,,,0,,,,,S,sols,,,35,5.530793,46.626182
2020-578345,2020-08-28,000001,Vente,125000,,,AU VILLAGE,B029,39570,39250,Geruge,39,,,39250000AB0039,,,,,,,,,,,,,0,,,,,J,jardins,,,274,5.530454,46.625831
2020-580553,2020-12-21,000001,Vente,2892,,,SUR GRAVELLE,B022,39570,39250,Geruge,39,,,392500000B0022,,,,,,,,,,,,,0,,,,,T,terres,,,2479,5.534154,46.63553
2020-580553,2020-12-21,000001,Vente,2892,,,COMBE DE VAUX,B012,39570,39250,Geruge,39,,,392500000B0096,,,,,,,,,,,,,0,,,,,T,terres,,,3312,5.535033,46.62826
2020-580553,2020-12-21,000001,Vente,2892,,,COMBE DE VAUX,B012,39570,39250,Geruge,39,,,392500000B0160,,,,,,,,,,,,,0,,,,,T,terres,,,3313,5.535245,46.629125
2020-580553,2020-12-21,000001,Vente,2892,,,COMBE DE VAUX,B012,39570,39250,Geruge,39,,,392500000B0171,,,,,,,,,,,,,0,,,,,T,terres,,,3395,5.534845,46.628671
2020-580553,2020-12-21,000001,Vente,2892,,,EN BIEF,B002,39570,39250,Geruge,39,,,392500000C0105,,,,,,,,,,,,,0,,,,,P,prés,,,6808,5.532888,46.609623
2020-580553,2020-12-21,000001,Vente,2892,,,EN BIEF,B002,39570,39250,Geruge,39,,,392500000C0106,,,,,,,,,,,,,0,,,,,P,prés,,,1630,5.531156,46.607276
2020-580553,2020-12-21,000001,Vente,2892,,,A LA COTE,B014,39570,39250,Geruge,39,,,392500000E0034,,,,,,,,,,,,,0,,,,,P,prés,,,3204,5.525221,46.631694
