id_mutation,date_mutation,numero_disposition,nature_mutation,valeur_fonciere,adresse_numero,adresse_suffixe,adresse_nom_voie,adresse_code_voie,code_postal,code_commune,nom_commune,code_departement,ancien_code_commune,ancien_nom_commune,id_parcelle,ancien_id_parcelle,numero_volume,lot1_numero,lot1_surface_carrez,lot2_numero,lot2_surface_carrez,lot3_numero,lot3_surface_carrez,lot4_numero,lot4_surface_carrez,lot5_numero,lot5_surface_carrez,nombre_lots,code_type_local,type_local,surface_reelle_bati,nombre_pieces_principales,code_nature_culture,nature_culture,code_nature_culture_speciale,nature_culture_speciale,surface_terrain,longitude,latitude
2020-575699,2020-03-27,000001,Vente,166000,17,B,RUE FRANCHE,0065,39700,39513,Sermange,39,,,39513000AD0137,,,,,,,,,,,,,0,3,Dépendance,,0,S,sols,,,243,5.646678,47.191037
2020-575699,2020-03-27,000001,Vente,166000,17,B,RUE FRANCHE,0065,39700,39513,Sermange,39,,,39513000AD0137,,,,,,,,,,,,,0,2,Appartement,191,6,S,sols,,,243,5.646678,47.191037
2020-575699,2020-03-27,000001,Vente,166000,17,B,RUE FRANCHE,0065,39700,39513,Sermange,39,,,39513000AD0137,,,,,,,,,,,,,0,3,Dépendance,,0,S,sols,,,243,5.646678,47.191037
2020-575699,2020-03-27,000001,Vente,166000,17,,RUE FRANCHE,0065,39700,39513,Sermange,39,,,39513000AD0138,,,,,,,,,,,,,0,2,Appartement,86,4,S,sols,,,697,5.646907,47.191139
2020-575699,2020-03-27,000001,Vente,166000,17,,RUE FRANCHE,0065,39700,39513,Sermange,39,,,39513000AD0138,,,,,,,,,,,,,0,3,Dépendance,,0,S,sols,,,697,5.646907,47.191139
2020-575699,2020-03-27,000001,Vente,166000,,,LE VILLAGE,B021,39700,39513,Sermange,39,,,39513000AD0139,,,,,,,,,,,,,0,,,,,P,prés,,,150,5.646822,47.190888
2020-575699,2020-03-27,000001,Vente,166000,,,LE VILLAGE,B021,39700,39513,Sermange,39,,,39513000AD0140,,,,,,,,,,,,,0,,,,,P,prés,,,679,5.647163,47.190857
2020-575699,2020-03-27,000001,Vente,166000,,,A L ARE,B001,39700,39513,Sermange,39,,,39513000ZD0016,,,,,,,,,,,,,0,,,,,P,prés,,,990,5.647388,47.190634
2020-576933,2020-06-25,000001,Vente,361280,4,,RUE DU CHOULOT,0025,39700,39513,Sermange,39,,,39513000ZE0029,,,,,,,,,,,,,0,1,Maison,108,4,S,sols,,,1500,5.645836,47.192885
2020-576933,2020-06-25,000001,Vente,361280,4,,RUE DU CHOULOT,0025,39700,39513,Sermange,39,,,39513000ZE0029,,,,,,,,,,,,,0,1,Maison,108,4,T,terres,,,18780,5.645836,47.192885
2020-578155,2020-09-01,000001,Vente,98500,,,LE VILLAGE,B021,39700,39513,Sermange,39,,,39513000AD0265,,,2,144.36,3,,4,,5,,6,,8,2,Appartement,62,3,,,,,,5.649424,47.192519
2020-578155,2020-09-01,000001,Vente,98500,,,LE VILLAGE,B021,39700,39513,Sermange,39,,,39513000AD0267,,,,,,,,,,,,,0,,,,,P,prés,,,125,5.649145,47.192625
2020-578155,2020-09-01,000001,Vente,98500,2,,RUE FRANCHE,0065,39700,39513,Sermange,39,,,39513000AD0278,,,,,,,,,,,,,0,1,Maison,85,3,S,sols,,,751,5.649043,47.192473
2020-578900,2020-10-13,000001,Vente,15000,7,,RUE FRANCHE,0065,39700,39513,Sermange,39,,,39513000AD0234,,,,,,,,,,,,,0,1,Maison,102,3,S,sols,,,389,5.64956,47.192114
2020-578900,2020-10-13,000001,Vente,15000,7,,RUE FRANCHE,0065,39700,39513,Sermange,39,,,39513000AD0236,,,,,,,,,,,,,0,,,,,S,sols,,,63,5.649384,47.192015
2020-579674,2020-11-05,000001,Vente,300000,2,,RUE DU CHOULOT,0025,39700,39513,Sermange,39,,,39513000ZE0064,,,,,,,,,,,,,0,1,Maison,226,6,P,prés,,,867,5.646783,47.193197
2020-579674,2020-11-05,000001,Vente,300000,2,,RUE DU CHOULOT,0025,39700,39513,Sermange,39,,,39513000ZE0064,,,,,,,,,,,,,0,1,Maison,226,6,P,prés,,,1430,5.646783,47.193197
2020-580573,2020-12-23,000001,Vente,60000,,,LE VILLAGE,B021,39700,39513,Sermange,39,,,39513000AD0090,,,,,,,,,,,,,0,,,,,P,prés,,,4732,5.650547,47.192181
2020-580573,2020-12-23,000001,Vente,60000,1,,RUE FRANCHE,0065,39700,39513,Sermange,39,,,39513000AD0091,,,,,,,,,,,,,0,1,Maison,109,3,S,sols,,,1354,5.649849,47.192469
