id_mutation,date_mutation,numero_disposition,nature_mutation,valeur_fonciere,adresse_numero,adresse_suffixe,adresse_nom_voie,adresse_code_voie,code_postal,code_commune,nom_commune,code_departement,ancien_code_commune,ancien_nom_commune,id_parcelle,ancien_id_parcelle,numero_volume,lot1_numero,lot1_surface_carrez,lot2_numero,lot2_surface_carrez,lot3_numero,lot3_surface_carrez,lot4_numero,lot4_surface_carrez,lot5_numero,lot5_surface_carrez,nombre_lots,code_type_local,type_local,surface_reelle_bati,nombre_pieces_principales,code_nature_culture,nature_culture,code_nature_culture_speciale,nature_culture_speciale,surface_terrain,longitude,latitude
2020-582209,2020-02-10,000001,Vente,155000,618,,CHEM DE NOUAOU,0100,40120,40033,Bélis,40,,,400330000B0230,,,,,,,,,,,,,0,1,Maison,88,4,S,sols,,,965,-0.473447,44.065648
2020-582209,2020-02-10,000001,Vente,155000,,,MAURANX,B027,40120,40033,Bélis,40,,,400330000B0465,,,,,,,,,,,,,0,,,,,BR,futaies résineuses,PIN,Pins,2261,-0.473428,44.0656
2020-582209,2020-02-10,000001,Vente,155000,,,IZOTTE,B018,40120,40033,Bélis,40,,,400330000B0468,,,,,,,,,,,,,0,,,,,BR,futaies résineuses,PIN,Pins,1852,-0.472988,44.065445
2020-587068,2020-07-22,000001,Vente,263000,18,,IZOTTE,B018,40120,40033,Bélis,40,,,400330000B0097,,,,,,,,,,,,,0,1,Maison,94,3,S,sols,,,1205,-0.463161,44.06354
2020-587068,2020-07-22,000001,Vente,263000,,,IZOTTE,B018,40120,40033,Bélis,40,,,400330000B0098,,,,,,,,,,,,,0,,,,,J,jardins,,,1035,-0.463026,44.063675
2020-587068,2020-07-22,000001,Vente,263000,,,IZOTTE,B018,40120,40033,Bélis,40,,,400330000B0675,,,,,,,,,,,,,0,,,,,BT,taillis simples,,,6212,-0.462887,44.063478
2020-587068,2020-07-22,000001,Vente,263000,,,IZOTTE,B018,40120,40033,Bélis,40,,,400330000B0679,,,,,,,,,,,,,0,,,,,T,terres,,,796,-0.463634,44.063626
2020-587068,2020-07-22,000001,Vente,263000,,,IZOTTE,B018,40120,40033,Bélis,40,,,400330000B0679,,,,,,,,,,,,,0,,,,,S,sols,,,366,-0.463634,44.063626
2020-590462,2020-10-20,000001,Vente,205000,,,IZOTTE,B018,40120,40033,Bélis,40,,,400330000B0424,,,,,,,,,,,,,0,,,,,BR,futaies résineuses,PIN,Pins,3880,-0.468976,44.06564
2020-590462,2020-10-20,000001,Vente,205000,,,IZOTTE,B018,40120,40033,Bélis,40,,,400330000B0427,,,,,,,,,,,,,0,,,,,L,landes,AIRE,Aire ou airial,570,-0.469028,44.06598
2020-590462,2020-10-20,000001,Vente,205000,,,IZOTTE,B018,40120,40033,Bélis,40,,,400330000B0427,,,,,,,,,,,,,0,,,,,S,sols,,,220,-0.469028,44.06598
2020-590462,2020-10-20,000001,Vente,205000,526,,ALL CHENES,0055,40120,40033,Bélis,40,,,400330000B0429,,,,,,,,,,,,,0,1,Maison,139,4,S,sols,,,583,-0.468879,44.065952
2020-592702,2020-12-10,000001,Vente,297000,,,ESTRUHAUT,B014,40120,40033,Bélis,40,,,400330000A0353,,,,,,,,,,,,,0,,,,,PA,pâtures,PATUR,Pâture plantée,1673,-0.499235,44.066029
2020-592702,2020-12-10,000001,Vente,297000,,,ESTRUHAUT,B014,40120,40033,Bélis,40,,,400330000A0355,,,,,,,,,,,,,0,,,,,PA,pâtures,PATUR,Pâture plantée,1245,-0.499917,44.066044
2020-592702,2020-12-10,000001,Vente,297000,,,ESTRUHAUT,B014,40120,40033,Bélis,40,,,400330000A0357,,,,,,,,,,,,,0,,,,,L,landes,AIRE,Aire ou airial,3059,-0.499014,44.065563
