id_mutation,date_mutation,numero_disposition,nature_mutation,valeur_fonciere,adresse_numero,adresse_suffixe,adresse_nom_voie,adresse_code_voie,code_postal,code_commune,nom_commune,code_departement,ancien_code_commune,ancien_nom_commune,id_parcelle,ancien_id_parcelle,numero_volume,lot1_numero,lot1_surface_carrez,lot2_numero,lot2_surface_carrez,lot3_numero,lot3_surface_carrez,lot4_numero,lot4_surface_carrez,lot5_numero,lot5_surface_carrez,nombre_lots,code_type_local,type_local,surface_reelle_bati,nombre_pieces_principales,code_nature_culture,nature_culture,code_nature_culture_speciale,nature_culture_speciale,surface_terrain,longitude,latitude
2020-582556,2020-02-11,000001,Vente,171000,,,LARTIGAUT,B020,40350,40101,Gaas,40,,,401010000B0442,,,,,,,,,,,,,0,,,,,BT,taillis simples,,,1281,-1.04496,43.620917
2020-582556,2020-02-11,000001,Vente,171000,1153,,RTE D'ESTANQUET,0035,40350,40101,Gaas,40,,,401010000B0443,,,,,,,,,,,,,0,1,Maison,102,4,S,sols,,,969,-1.045106,43.620724
2020-582556,2020-02-11,000001,Vente,171000,1153,,RTE D'ESTANQUET,0035,40350,40101,Gaas,40,,,401010000B0443,,,,,,,,,,,,,0,1,Maison,102,4,J,jardins,,,2100,-1.045106,43.620724
2020-583567,2020-03-06,000001,Vente,450650,1290,,RTE DU BEDOUICH,0005,40350,40101,Gaas,40,,,401010000B1261,,,,,,,,,,,,,0,1,Maison,138,5,S,sols,,,800,-1.027514,43.602257
2020-583567,2020-03-06,000001,Vente,450650,1290,,RTE DU BEDOUICH,0005,40350,40101,Gaas,40,,,401010000B1261,,,,,,,,,,,,,0,1,Maison,138,5,J,jardins,,,752,-1.027514,43.602257
2020-583567,2020-03-06,000001,Vente,450650,,,AUX CAMINS,B005,40350,40101,Gaas,40,,,401010000B1342,,,,,,,,,,,,,0,,,,,T,terres,,,2706,-1.02766,43.602531
2020-584132,2020-05-19,000001,Vente,45560,,,LOUSTAOUNAOU,B024,40350,40101,Gaas,40,,,401010000A0604,,,,,,,,,,,,,0,,,,,AB,terrains a bâtir,,,771,-1.044782,43.621466
2020-584132,2020-05-19,000001,Vente,45560,,,LOUSTAOUNAOU,B024,40350,40101,Gaas,40,,,401010000A0606,,,,,,,,,,,,,0,,,,,AB,terrains a bâtir,,,1060,-1.044951,43.621196
2020-584132,2020-05-19,000001,Vente,45560,,,LOUSTAOUNAOU,B024,40350,40101,Gaas,40,,,401010000A0607,,,,,,,,,,,,,0,,,,,AB,terrains a bâtir,,,748,-1.044632,43.621109
2020-584132,2020-05-19,000001,Vente,45560,,,LOUSTAOUNAOU,B024,40350,40101,Gaas,40,,,401010000A0611,,,,,,,,,,,,,0,,,,,AB,terrains a bâtir,,,707,-1.044492,43.62144
2020-584276,2020-05-20,000001,Vente,57000,,,LE BOURG,B004,40350,40101,Gaas,40,,,401010000B1387,,,,,,,,,,,,,0,,,,,AB,terrains a bâtir,,,1750,-1.03398,43.612637
2020-584276,2020-05-20,000001,Vente,57000,76,,IMP DES PYRENEES,0122,40350,40101,Gaas,40,,,401010000B1390,,,,,,,,,,,,,0,,,,,AB,terrains a bâtir,,,1167,-1.034736,43.612621
2020-584422,2020-05-27,000001,Vente,195000,197,,CHE DE MIMBASTE,0103,40350,40101,Gaas,40,,,401010000A0501,,,,,,,,,,,,,0,1,Maison,114,5,S,sols,,,900,-1.023698,43.613864
2020-584422,2020-05-27,000001,Vente,195000,197,,CHE DE MIMBASTE,0103,40350,40101,Gaas,40,,,401010000A0501,,,,,,,,,,,,,0,1,Maison,114,5,J,jardins,,,600,-1.023698,43.613864
2020-584422,2020-05-27,000001,Vente,195000,,,LANNE,B017,40350,40101,Gaas,40,,,401010000A0545,,,,,,,,,,,,,0,,,,,BR,futaies résineuses,PIN,Pins,1855,-1.023277,43.614603
2020-585537,2020-06-24,000001,Vente,215000,162,,RTE DE MIOUSICQ,0105,40350,40101,Gaas,40,,,401010000B1347,,,,,,,,,,,,,0,1,Maison,116,3,S,sols,,,700,-1.044647,43.602322
2020-585537,2020-06-24,000001,Vente,215000,162,,RTE DE MIOUSICQ,0105,40350,40101,Gaas,40,,,401010000B1347,,,,,,,,,,,,,0,1,Maison,116,3,J,jardins,,,806,-1.044647,43.602322
2020-586214,2020-07-09,000001,Vente,20000,,,AUX LUCS,B025,40350,40101,Gaas,40,,,401010000A0199,,,,,,,,,,,,,0,,,,,BT,taillis simples,,,2600,-1.033157,43.616671
2020-586214,2020-07-09,000001,Vente,20000,,,AUX LUCS,B025,40350,40101,Gaas,40,,,401010000A0200,,,,,,,,,,,,,0,,,,,BT,taillis simples,,,9557,-1.034549,43.616706
2020-586214,2020-07-09,000001,Vente,20000,,,AUX LUCS,B025,40350,40101,Gaas,40,,,401010000A0201,,,,,,,,,,,,,0,,,,,T,terres,,,3005,-1.034285,43.616293
2020-586214,2020-07-09,000001,Vente,20000,,,AUX LUCS,B025,40350,40101,Gaas,40,,,401010000A0202,,,,,,,,,,,,,0,,,,,T,terres,,,8178,-1.033512,43.615968
2020-586214,2020-07-09,000001,Vente,20000,,,AUX LUCS,B025,40350,40101,Gaas,40,,,401010000A0204,,,,,,,,,,,,,0,,,,,T,terres,,,14631,-1.036406,43.615804
2020-586214,2020-07-09,000001,Vente,20000,,,AUX LUCS,B025,40350,40101,Gaas,40,,,401010000A0204,,,,,,,,,,,,,0,,,,,T,terres,,,4800,-1.036406,43.615804
2020-587131,2020-07-29,000001,Vente,533580,,,MIOUSIQ,B026,40350,40101,Gaas,40,,,401010000C0016,,,,,,,,,,,,,0,,,,,BT,taillis simples,,,5560,-1.053557,43.600229
2020-587131,2020-07-29,000001,Vente,533580,,,MIOUSIQ,B026,40350,40101,Gaas,40,,,401010000C0026,,,,,,,,,,,,,0,,,,,BT,taillis simples,,,100,-1.05299,43.597738
2020-587131,2020-07-29,000001,Vente,533580,,,MIOUSIQ,B026,40350,40101,Gaas,40,,,401010000C0027,,,,,,,,,,,,,0,,,,,BT,taillis simples,,,240,-1.052914,43.597639
2020-588944,2020-09-22,000001,Vente,69500,,,LA BARTHE,B002,40350,40101,Gaas,40,,,401010000B0720,,,,,,,,,,,,,0,,,,,T,terres,,,3177,-1.05758,43.620759
2020-588944,2020-09-22,000001,Vente,69500,,,LA BARTHE,B002,40350,40101,Gaas,40,,,401010000B0720,,,,,,,,,,,,,0,,,,,S,sols,,,238,-1.05758,43.620759
2020-588944,2020-09-22,000001,Vente,69500,,,LA BARTHE,B002,40350,40101,Gaas,40,,,401010000B0727,,,,,,,,,,,,,0,,,,,BT,taillis simples,,,3060,-1.058112,43.62184
2020-588944,2020-09-22,000001,Vente,69500,,,LA BARTHE,B002,40350,40101,Gaas,40,,,401010000B0731,,,,,,,,,,,,,0,,,,,BT,taillis simples,,,7720,-1.057597,43.622516
2020-588944,2020-09-22,000001,Vente,69500,,,LA BARTHE,B002,40350,40101,Gaas,40,,,401010000B0732,,,,,,,,,,,,,0,,,,,S,sols,,,100,-1.057136,43.622486
2020-588944,2020-09-22,000001,Vente,69500,,,LA BARTHE,B002,40350,40101,Gaas,40,,,401010000B0732,,,,,,,,,,,,,0,,,,,BT,taillis simples,,,10600,-1.057136,43.622486
2020-588944,2020-09-22,000001,Vente,69500,298,,RTE DE PEYREHORADE,0110,40350,40101,Gaas,40,,,401010000B0733,,,,,,,,,,,,,0,1,Maison,137,4,S,sols,,,320,-1.056153,43.621509
2020-588944,2020-09-22,000001,Vente,69500,,,LA BARTHE,B002,40350,40101,Gaas,40,,,401010000B0734,,,,,,,,,,,,,0,,,,,J,jardins,,,630,-1.055822,43.621652
2020-588944,2020-09-22,000001,Vente,69500,,,LA BARTHE,B002,40350,40101,Gaas,40,,,401010000B1325,,,,,,,,,,,,,0,,,,,BT,taillis simples,,,155,-1.056096,43.621691
2020-590258,2020-10-27,000001,Vente,14000,,,TREMOULET,B031,40350,40101,Gaas,40,,,401010000A0113,,,,,,,,,,,,,0,,,,,T,terres,,,1150,-1.022317,43.615067
2020-590258,2020-10-27,000001,Vente,14000,,,LANNE,B017,40350,40101,Gaas,40,,,401010000A0150,,,,,,,,,,,,,0,,,,,T,terres,,,3940,-1.022151,43.61453
2020-591745,2020-11-26,000001,Vente,68000,,,LE BOURG,B004,40350,40101,Gaas,40,,,401010000B1389,,,,,,,,,,,,,0,,,,,AB,terrains a bâtir,,,2514,-1.033991,43.61305
2020-591745,2020-11-26,000001,Vente,68000,76,,IMP DES PYRENEES,0122,40350,40101,Gaas,40,,,401010000B1390,,,,,,,,,,,,,0,,,,,AB,terrains a bâtir,,,1167,-1.034736,43.612621
2020-592330,2020-12-09,000001,Vente,38000,,,PRECHACQ,B030,40350,40101,Gaas,40,,,401010000B0001,,,,,,,,,,,,,0,,,,,T,terres,,,2640,-1.042091,43.602318
