id_mutation,date_mutation,numero_disposition,nature_mutation,valeur_fonciere,adresse_numero,adresse_suffixe,adresse_nom_voie,adresse_code_voie,code_postal,code_commune,nom_commune,code_departement,ancien_code_commune,ancien_nom_commune,id_parcelle,ancien_id_parcelle,numero_volume,lot1_numero,lot1_surface_carrez,lot2_numero,lot2_surface_carrez,lot3_numero,lot3_surface_carrez,lot4_numero,lot4_surface_carrez,lot5_numero,lot5_surface_carrez,nombre_lots,code_type_local,type_local,surface_reelle_bati,nombre_pieces_principales,code_nature_culture,nature_culture,code_nature_culture_speciale,nature_culture_speciale,surface_terrain,longitude,latitude
2020-583700,2020-04-07,000001,Vente,2500,,,LE GRICHT DE BAS,B018,40250,40141,Lahosse,40,,,401410000C0123,,,,,,,,,,,,,0,,,,,BF,futaies feuillues,,,4091,-0.775138,43.717292
2020-583700,2020-04-07,000001,Vente,2500,,,LES HOUQUETS,B020,40250,40141,Lahosse,40,,,401410000D0154,,,,,,,,,,,,,0,,,,,T,terres,,,3285,-0.774993,43.705538
2020-588740,2020-09-21,000001,Vente,40000,,,MAURA,B027,40250,40141,Lahosse,40,,,401410000A0519,,,,,,,,,,,,,0,,,,,AB,terrains a bâtir,,,1637,-0.801517,43.71386
2020-588740,2020-09-21,000001,Vente,40000,,,MAURA,B027,40250,40141,Lahosse,40,,,401410000A0520,,,,,,,,,,,,,0,,,,,AB,terrains a bâtir,,,1923,-0.801713,43.713687
2020-591684,2020-11-30,000001,Vente,50000,,,L EGLISE,B014,40250,40141,Lahosse,40,,,401410000B0001,,,,,,,,,,,,,0,,,,,T,terres,,,4889,-0.800886,43.714832
2020-591684,2020-11-30,000001,Vente,50000,1365,,RTE DES COTEAUX,0050,40250,40141,Lahosse,40,,,401410000B0002,,,,,,,,,,,,,0,1,Maison,160,5,S,sols,,,1097,-0.800888,43.714428
2020-591684,2020-11-30,000001,Vente,50000,,,L EGLISE,B014,40250,40141,Lahosse,40,,,401410000B0003,,,,,,,,,,,,,0,,,,,J,jardins,,,757,-0.8005,43.714396
2020-591684,2020-11-30,000001,Vente,50000,,,L EGLISE,B014,40250,40141,Lahosse,40,,,401410000B0004,,,,,,,,,,,,,0,,,,,T,terres,,,7501,-0.800559,43.714115
2020-591684,2020-11-30,000001,Vente,50000,,,L EGLISE,B014,40250,40141,Lahosse,40,,,401410000B0005,,,,,,,,,,,,,0,,,,,T,terres,,,4060,-0.799982,43.714709
2020-591684,2020-11-30,000001,Vente,50000,,,L EGLISE,B014,40250,40141,Lahosse,40,,,401410000B0006,,,,,,,,,,,,,0,,,,,T,terres,,,2260,-0.79932,43.714779
2020-591684,2020-11-30,000001,Vente,50000,,,L EGLISE,B014,40250,40141,Lahosse,40,,,401410000B0007,,,,,,,,,,,,,0,,,,,T,terres,,,2200,-0.799466,43.71421
2020-591684,2020-11-30,000001,Vente,50000,,,L EGLISE,B014,40250,40141,Lahosse,40,,,401410000B0008,,,,,,,,,,,,,0,,,,,T,terres,,,2100,-0.799602,43.713689
2020-591962,2020-11-25,000001,Vente,170000,37,,RTE DE CASSIET,0040,40250,40141,Lahosse,40,,,401410000A0476,,,,,,,,,,,,,0,1,Maison,78,4,S,sols,,,1712,-0.799742,43.710955
