id_mutation,date_mutation,numero_disposition,nature_mutation,valeur_fonciere,adresse_numero,adresse_suffixe,adresse_nom_voie,adresse_code_voie,code_postal,code_commune,nom_commune,code_departement,ancien_code_commune,ancien_nom_commune,id_parcelle,ancien_id_parcelle,numero_volume,lot1_numero,lot1_surface_carrez,lot2_numero,lot2_surface_carrez,lot3_numero,lot3_surface_carrez,lot4_numero,lot4_surface_carrez,lot5_numero,lot5_surface_carrez,nombre_lots,code_type_local,type_local,surface_reelle_bati,nombre_pieces_principales,code_nature_culture,nature_culture,code_nature_culture_speciale,nature_culture_speciale,surface_terrain,longitude,latitude
2020-594413,2020-02-07,000001,Vente,15000,,,LES RUAUX,B139,41700,41050,Cheverny,41,,,410500000H0347,,,,,,,,,,,,,0,,,,,P,prés,,,3369,1.432073,47.488546
2020-595308,2020-02-21,000001,Vente,572000,,,LEZEAU,B091,41700,41050,Cheverny,41,,,410500000L0427,,,,,,,,,,,,,0,,,,,BT,taillis simples,,,5170,1.417164,47.506711
2020-595308,2020-02-21,000001,Vente,572000,,,LEZEAU,B091,41700,41050,Cheverny,41,,,410500000L0434,,,,,,,,,,,,,0,,,,,BT,taillis simples,,,512,1.416583,47.507896
2020-595308,2020-02-21,000001,Vente,572000,,,LE GRAVIER,B082,41700,41050,Cheverny,41,,,410500000L0463,,,,,,,,,,,,,0,,,,,BT,taillis simples,,,1466,1.418604,47.505453
2020-595308,2020-02-21,000001,Vente,572000,,,LE GRAVIER,B082,41700,41050,Cheverny,41,,,410500000L0464,,,,,,,,,,,,,0,,,,,BT,taillis simples,,,2004,1.418469,47.505555
2020-595308,2020-02-21,000001,Vente,572000,,,LE GRAVIER,B082,41700,41050,Cheverny,41,,,410500000L0465,,,,,,,,,,,,,0,,,,,BT,taillis simples,,,873,1.418437,47.505675
2020-595308,2020-02-21,000001,Vente,572000,,,LE GRAVIER,B082,41700,41050,Cheverny,41,,,410500000L0466,,,,,,,,,,,,,0,,,,,BT,taillis simples,,,760,1.418557,47.505777
2020-595308,2020-02-21,000001,Vente,572000,,,LE GRAVIER,B082,41700,41050,Cheverny,41,,,410500000L0467,,,,,,,,,,,,,0,,,,,BT,taillis simples,,,795,1.418296,47.505822
2020-595308,2020-02-21,000001,Vente,572000,,,LE GRAVIER,B082,41700,41050,Cheverny,41,,,410500000L0477,,,,,,,,,,,,,0,,,,,BT,taillis simples,,,504,1.417509,47.505892
2020-595308,2020-02-21,000001,Vente,572000,,,LE GRAVIER,B082,41700,41050,Cheverny,41,,,410500000L0478,,,,,,,,,,,,,0,,,,,BT,taillis simples,,,4643,1.417295,47.506118
2020-595308,2020-02-21,000001,Vente,572000,,,L AVENTURE,B010,41700,41050,Cheverny,41,,,410500000L0486,,,,,,,,,,,,,0,,,,,T,terres,,,13375,1.419465,47.504937
2020-595308,2020-02-21,000001,Vente,572000,,,L AVENTURE,B010,41700,41050,Cheverny,41,,,410500000L0486,,,,,,,,,,,,,0,,,,,BT,taillis simples,,,13375,1.419465,47.504937
2020-595308,2020-02-21,000001,Vente,572000,,,L AVENTURE,B010,41700,41050,Cheverny,41,,,410500000L0486,,,,,,,,,,,,,0,,,,,BT,taillis simples,,,2805,1.419465,47.504937
2020-595308,2020-02-21,000001,Vente,572000,2,,CHEM DE LA CANETERIE,0023,41700,41050,Cheverny,41,,,410500000L0487,,,,,,,,,,,,,0,4,Local industriel. commercial ou assimilé,90,0,S,sols,,,876,1.420624,47.505074
2020-595308,2020-02-21,000001,Vente,572000,2,,CHEM DE LA CANETERIE,0023,41700,41050,Cheverny,41,,,410500000L0487,,,,,,,,,,,,,0,1,Maison,141,4,S,sols,,,876,1.420624,47.505074
2020-595308,2020-02-21,000001,Vente,572000,,,L AVENTURE,B010,41700,41050,Cheverny,41,,,410500000L0488,,,,,,,,,,,,,0,,,,,BT,taillis simples,,,5545,1.41945,47.504129
2020-595308,2020-02-21,000001,Vente,572000,,,LA TALONNERIE,B145,41700,41050,Cheverny,41,,,410500000L0530,,,,,,,,,,,,,0,,,,,BT,taillis simples,,,1952,1.417646,47.502912
2020-595308,2020-02-21,000001,Vente,572000,,,LA TALONNERIE,B145,41700,41050,Cheverny,41,,,410500000L0531,,,,,,,,,,,,,0,,,,,BT,taillis simples,,,3425,1.417541,47.503155
2020-595308,2020-02-21,000001,Vente,572000,,,LA TALONNERIE,B145,41700,41050,Cheverny,41,,,410500000L0532,,,,,,,,,,,,,0,,,,,BT,taillis simples,,,1464,1.417825,47.503762
2020-595308,2020-02-21,000001,Vente,572000,,,LE GRAVIER,B082,41700,41050,Cheverny,41,,,410500000L0586,,,,,,,,,,,,,0,,,,,BT,taillis simples,,,1407,1.418682,47.505312
2020-595308,2020-02-21,000001,Vente,572000,,,LE GRAVIER,B082,41700,41050,Cheverny,41,,,410500000L0589,,,,,,,,,,,,,0,,,,,BT,taillis simples,,,117,1.419069,47.505376
2020-595689,2020-04-01,000001,Vente,3394,,,FACHODA,B072,41700,41050,Cheverny,41,,,410500000I0259,,,,,,,,,,,,,0,,,,,T,terres,,,9655,1.441706,47.476096
2020-595689,2020-04-01,000001,Vente,3394,,,FACHODA,B072,41700,41050,Cheverny,41,,,410500000I0260,,,,,,,,,,,,,0,,,,,T,terres,,,463,1.443033,47.475522
2020-595689,2020-04-01,000001,Vente,3394,,,FACHODA,B072,41700,41050,Cheverny,41,,,410500000I0267,,,,,,,,,,,,,0,,,,,T,terres,,,4640,1.441873,47.476453
2020-595895,2020-04-23,000001,Vente,4176,,,FACHODA,B072,41700,41050,Cheverny,41,,,410500000I0253,,,,,,,,,,,,,0,,,,,T,terres,,,8300,1.445726,47.475574
2020-595895,2020-04-23,000001,Vente,4176,,,FACHODA,B072,41700,41050,Cheverny,41,,,410500000I0316,,,,,,,,,,,,,0,,,,,T,terres,,,9858,1.445456,47.475949
2020-596108,2020-05-14,000001,Vente,206000,,,LA CARTONNIERE,B044,41700,41050,Cheverny,41,,,410500000A0270,,,,,,,,,,,,,0,,,,,S,sols,,,480,1.471885,47.492706
2020-596108,2020-05-14,000001,Vente,206000,,,LA CARTONNIERE,B044,41700,41050,Cheverny,41,,,410500000A0528,,,,,,,,,,,,,0,,,,,T,terres,,,400,1.47135,47.492597
2020-596108,2020-05-14,000001,Vente,206000,,,LA CARTONNIERE,B044,41700,41050,Cheverny,41,,,410500000A0529,,,,,,,,,,,,,0,,,,,T,terres,,,228,1.471634,47.492662
2020-596108,2020-05-14,000001,Vente,206000,,,LA CARTONNIERE,B044,41700,41050,Cheverny,41,,,410500000A0711,,,,,,,,,,,,,0,,,,,VI,vignes,,,201,1.471251,47.492615
2020-596108,2020-05-14,000001,Vente,206000,,,LA CARTONNIERE,B044,41700,41050,Cheverny,41,,,410500000A0771,,,,,,,,,,,,,0,,,,,T,terres,,,646,1.47148,47.492468
2020-596108,2020-05-14,000001,Vente,206000,14,,RTE DU BUCHER,0020,41700,41050,Cheverny,41,,,410500000A0964,,,,,,,,,,,,,0,1,Maison,117,4,S,sols,,,541,1.471592,47.49285
2020-597725,2020-07-06,000001,Vente,5000,,,LE BOURG,B037,41700,41050,Cheverny,41,,,41050000AB0224,,,,,,,,,,,,,0,,,,,S,sols,,,40,1.46053,47.502096
2020-597784,2020-07-23,000001,Vente,121000,3,,VOIE DE LA PREASLE,0183,41700,41050,Cheverny,41,,,410500000M0064,,,,,,,,,,,,,0,1,Maison,70,2,S,sols,,,374,1.442523,47.506147
2020-597784,2020-07-23,000001,Vente,121000,,,LES PETITES PERAUDIERES,B116,41700,41050,Cheverny,41,,,410500000M0065,,,,,,,,,,,,,0,,,,,S,sols,,,341,1.442723,47.505955
2020-597784,2020-07-23,000001,Vente,121000,,,LES PETITES PERAUDIERES,B116,41700,41050,Cheverny,41,,,410500000M0356,,,,,,,,,,,,,0,,,,,S,sols,,,197,1.442402,47.506057
2020-598081,2020-07-17,000001,Vente,216000,6,B,VC DU TREMBLAY,0300,41700,41050,Cheverny,41,,,410500000K0564,,,,,,,,,,,,,0,1,Maison,105,4,S,sols,,,850,1.44632,47.490275
2020-598114,2020-07-31,000001,Vente,130000,2,,VOIE DE LA DEMALERIE,0056,41700,41050,Cheverny,41,,,410500000H0099,,,,,,,,,,,,,0,1,Maison,78,4,J,jardins,,,3335,1.433823,47.484586
2020-598114,2020-07-31,000001,Vente,130000,2,,VOIE DE LA DEMALERIE,0056,41700,41050,Cheverny,41,,,410500000H0099,,,,,,,,,,,,,0,1,Maison,78,4,S,sols,,,1595,1.433823,47.484586
2020-598114,2020-07-31,000001,Vente,130000,,,LE SAINT NOT,B141,41700,41050,Cheverny,41,,,410500000H0100,,,,,,,,,,,,,0,,,,,T,terres,,,2075,1.433011,47.483699
2020-598114,2020-07-31,000001,Vente,130000,,,LE SAINT NOT,B141,41700,41050,Cheverny,41,,,410500000H0100,,,,,,,,,,,,,0,,,,,BR,futaies résineuses,,,2038,1.433011,47.483699
2020-598114,2020-07-31,000001,Vente,130000,,,LE SAINT NOT,B141,41700,41050,Cheverny,41,,,410500000H0100,,,,,,,,,,,,,0,,,,,T,terres,,,2030,1.433011,47.483699
2020-598114,2020-07-31,000001,Vente,130000,,,LE SAINT NOT,B141,41700,41050,Cheverny,41,,,410500000H0100,,,,,,,,,,,,,0,,,,,BT,taillis simples,,,1320,1.433011,47.483699
2020-598627,2020-08-26,000001,Vente,184000,9,,RTE DE L'AUMONE,0016,41700,41050,Cheverny,41,,,410500000M0304,,,,,,,,,,,,,0,1,Maison,135,6,S,sols,,,655,1.435669,47.502928
2020-598627,2020-08-26,000001,Vente,184000,9,,RTE DE L'AUMONE,0016,41700,41050,Cheverny,41,,,410500000M0304,,,,,,,,,,,,,0,1,Maison,135,6,AG,terrains d'agrément,,,1775,1.435669,47.502928
2020-598831,2020-09-07,000001,Vente,258500,1,B,CHEM DE LA CANETERIE,0023,41700,41050,Cheverny,41,,,410500000L0790,,,,,,,,,,,,,0,1,Maison,112,4,S,sols,,,1311,1.42197,47.50677
2020-598831,2020-09-07,000001,Vente,258500,,,LA CANETERIE,B042,41700,41050,Cheverny,41,,,410500000L0791,,,,,,,,,,,,,0,,,,,S,sols,,,71,1.421666,47.506926
2020-598865,2020-09-18,000001,Vente,207830,,,L ETARGE,B071,41700,41050,Cheverny,41,,,410500000L0267,,,,,,,,,,,,,0,,,,,E,eaux,MARE,Mare,830,1.42791,47.499487
2020-598865,2020-09-18,000001,Vente,207830,2,,CHEM DE L'ETARGE,0073,41700,41050,Cheverny,41,,,410500000L0276,,,,,,,,,,,,,0,1,Maison,120,3,S,sols,,,1500,1.427066,47.498716
2020-598865,2020-09-18,000001,Vente,207830,,,L ETARGE,B071,41700,41050,Cheverny,41,,,410500000L0277,,,,,,,,,,,,,0,,,,,BT,taillis simples,,,1078,1.426743,47.498979
2020-598865,2020-09-18,000001,Vente,207830,,,L ETARGE,B071,41700,41050,Cheverny,41,,,410500000L0626,,,,,,,,,,,,,0,,,,,S,sols,,,105,1.427388,47.498306
2020-598865,2020-09-18,000001,Vente,207830,,,L ETARGE,B071,41700,41050,Cheverny,41,,,410500000L0626,,,,,,,,,,,,,0,,,,,AG,terrains d'agrément,,,4086,1.427388,47.498306
2020-598865,2020-09-18,000001,Vente,207830,,,L ETARGE,B071,41700,41050,Cheverny,41,,,410500000L0631,,,,,,,,,,,,,0,,,,,BT,taillis simples,,,3704,1.427106,47.499847
2020-599470,2020-09-30,000001,Vente,170000,,,CHATEAU GAILLARD,B048,41700,41050,Cheverny,41,,,410500000A0605,,,,,,,,,,,,,0,,,,,S,sols,,,41,1.478449,47.488738
2020-599470,2020-09-30,000001,Vente,170000,,,CHATEAU GAILLARD,B048,41700,41050,Cheverny,41,,,410500000A0733,,,,,,,,,,,,,0,,,,,BR,futaies résineuses,,,321,1.478754,47.488864
2020-599470,2020-09-30,000001,Vente,170000,,,CHATEAU GAILLARD,B048,41700,41050,Cheverny,41,,,410500000A0735,,,,,,,,,,,,,0,,,,,S,sols,,,140,1.478782,47.488812
2020-599470,2020-09-30,000001,Vente,170000,5,,RTE DE L'EBAT,0070,41700,41050,Cheverny,41,,,410500000A0738,,,,,,,,,,,,,0,1,Maison,186,6,S,sols,,,323,1.478574,47.488721
2020-599470,2020-09-30,000001,Vente,170000,,,CHATEAU GAILLARD,B048,41700,41050,Cheverny,41,,,410500000A0934,,,,,,,,,,,,,0,,,,,AG,terrains d'agrément,,,124,1.478438,47.488806
2020-599470,2020-09-30,000001,Vente,170000,,,CHATEAU GAILLARD,B048,41700,41050,Cheverny,41,,,410500000A0936,,,,,,,,,,,,,0,,,,,AG,terrains d'agrément,,,383,1.478745,47.488935
2020-599514,2020-10-01,000001,Vente,2500,,,LES BOMBARDIERES,B033,41700,41050,Cheverny,41,,,410500000I0015,,,,,,,,,,,,,0,,,,,T,terres,,,1438,1.440977,47.483744
2020-599514,2020-10-01,000001,Vente,2500,,,LES BOMBARDIERES,B033,41700,41050,Cheverny,41,,,410500000I0016,,,,,,,,,,,,,0,,,,,T,terres,,,11020,1.44093,47.484237
2020-599719,2020-10-02,000001,Vente,390000,,,LA VEUVE SANS PAIN,B157,41700,41050,Cheverny,41,,,410500000A0452,,,,,,,,,,,,,0,,,,,AG,terrains d'agrément,,,746,1.480135,47.488371
2020-599719,2020-10-02,000001,Vente,390000,,,LA VEUVE SANS PAIN,B157,41700,41050,Cheverny,41,,,410500000A0453,,,,,,,,,,,,,0,,,,,S,sols,,,480,1.480267,47.488123
2020-599719,2020-10-02,000001,Vente,390000,,,LA VEUVE SANS PAIN,B157,41700,41050,Cheverny,41,,,410500000A0453,,,,,,,,,,,,,0,,,,,AG,terrains d'agrément,,,3224,1.480267,47.488123
2020-599719,2020-10-02,000001,Vente,390000,9,,RTE DE L'EBAT,0070,41700,41050,Cheverny,41,,,410500000A0454,,,,,,,,,,,,,0,1,Maison,160,6,S,sols,,,1180,1.480402,47.487771
2020-599719,2020-10-02,000001,Vente,390000,,,LA VEUVE SANS PAIN,B157,41700,41050,Cheverny,41,,,410500000A0455,,,,,,,,,,,,,0,,,,,J,jardins,,,3080,1.480669,47.487733
2020-599719,2020-10-02,000001,Vente,390000,,,LA VEUVE SANS PAIN,B157,41700,41050,Cheverny,41,,,410500000A0455,,,,,,,,,,,,,0,,,,,S,sols,,,120,1.480669,47.487733
2020-599825,2020-10-09,000001,Vente,168000,,,VILLAVRAIN,B158,41700,41050,Cheverny,41,,,410500000F0307,,,,,,,,,,,,,0,,,,,S,sols,,,39,1.429681,47.467246
2020-599825,2020-10-09,000001,Vente,168000,3,,CHEM DE VILLAVRAIN,0510,41700,41050,Cheverny,41,,,410500000F0308,,,,,,,,,,,,,0,1,Maison,93,4,AG,terrains d'agrément,,,1302,1.430174,47.467283
2020-599825,2020-10-09,000001,Vente,168000,3,,CHEM DE VILLAVRAIN,0510,41700,41050,Cheverny,41,,,410500000F0308,,,,,,,,,,,,,0,1,Maison,93,4,S,sols,,,500,1.430174,47.467283
2020-600130,2020-10-22,000001,Vente,335000,18,B,RTE DU BUCHER,0020,41700,41050,Cheverny,41,,,410500000A0973,,,,,,,,,,,,,0,1,Maison,137,4,S,sols,,,1626,1.47244,47.49202
2020-600194,2020-10-23,000001,Vente,63000,,,LE BOURG,B037,41700,41050,Cheverny,41,,,41050000AB0106,,,,,,,,,,,,,0,,,,,BT,taillis simples,,,1570,1.462452,47.501181
2020-600236,2020-10-29,000001,Vente,209600,32,,RTE DE ROMORANTIN,0200,41700,41050,Cheverny,41,,,41050000AD0007,,,,,,,,,,,,,0,1,Maison,88,3,AG,terrains d'agrément,,,1470,1.464837,47.500502
2020-600236,2020-10-29,000001,Vente,209600,32,,RTE DE ROMORANTIN,0200,41700,41050,Cheverny,41,,,41050000AD0007,,,,,,,,,,,,,0,1,Maison,88,3,S,sols,,,599,1.464837,47.500502
2020-600236,2020-10-29,000001,Vente,209600,32,,RTE DE ROMORANTIN,0200,41700,41050,Cheverny,41,,,41050000AD0008,,,,,,,,,,,,,0,,,,,S,sols,,,21,1.465195,47.500901
2020-600325,2020-10-27,000002,Vente,185000,,,LES BOMBARDIERES,B033,41700,41050,Cheverny,41,,,410500000I0005,,,,,,,,,,,,,0,,,,,BT,taillis simples,,,2200,1.442847,47.482836
2020-600325,2020-10-27,000002,Vente,185000,,,LES BOMBARDIERES,B033,41700,41050,Cheverny,41,,,410500000I0006,,,,,,,,,,,,,0,,,,,BT,taillis simples,,,3554,1.442799,47.483114
2020-600325,2020-10-27,000002,Vente,185000,,,LES BOMBARDIERES,B033,41700,41050,Cheverny,41,,,410500000I0006,,,,,,,,,,,,,0,,,,,BT,taillis simples,,,1800,1.442799,47.483114
2020-600325,2020-10-27,000002,Vente,185000,,,LES BOMBARDIERES,B033,41700,41050,Cheverny,41,,,410500000I0006,,,,,,,,,,,,,0,,,,,E,eaux,MARE,Mare,800,1.442799,47.483114
2020-600325,2020-10-27,000002,Vente,185000,,,LES BOMBARDIERES,B033,41700,41050,Cheverny,41,,,410500000I0007,,,,,,,,,,,,,0,,,,,S,sols,,,25,1.442504,47.483671
2020-600325,2020-10-27,000002,Vente,185000,26,,RTE DES BOMBARDIERES,0018,41700,41050,Cheverny,41,,,410500000I0013,,,,,,,,,,,,,0,1,Maison,130,4,S,sols,,,1218,1.4422,47.483942
2020-600325,2020-10-27,000002,Vente,185000,,,LES BOMBARDIERES,B033,41700,41050,Cheverny,41,,,410500000I0491,,,,,,,,,,,,,0,,,,,T,terres,,,993,1.441959,47.483745
2020-600325,2020-10-27,000002,Vente,185000,,,LES BOMBARDIERES,B033,41700,41050,Cheverny,41,,,410500000I0494,,,,,,,,,,,,,0,,,,,T,terres,,,297,1.44199,47.484034
2020-600325,2020-10-27,000002,Vente,185000,,,LES BOMBARDIERES,B033,41700,41050,Cheverny,41,,,410500000I0496,,,,,,,,,,,,,0,,,,,T,terres,,,34,1.442167,47.48415
2020-600945,2020-11-16,000001,Vente,305000,16,,RTE DE L'EBAT,0070,41700,41050,Cheverny,41,,,410500000B0079,,,,,,,,,,,,,0,1,Maison,179,4,S,sols,,,1592,1.484874,47.483216
2020-600945,2020-11-16,000001,Vente,305000,16,,RTE DE L'EBAT,0070,41700,41050,Cheverny,41,,,410500000B0079,,,,,,,,,,,,,0,1,Maison,179,4,AG,terrains d'agrément,,,1500,1.484874,47.483216
2020-600946,2020-11-16,000001,Vente,187000,2,,CHEM DE LAUNAY,0135,41700,41050,Cheverny,41,,,41050000AE0065,,,,,,,,,,,,,0,1,Maison,138,4,AG,terrains d'agrément,,,4693,1.467986,47.495954
2020-600946,2020-11-16,000001,Vente,187000,2,,CHEM DE LAUNAY,0135,41700,41050,Cheverny,41,,,41050000AE0065,,,,,,,,,,,,,0,1,Maison,138,4,S,sols,,,1421,1.467986,47.495954
2020-600970,2020-11-28,000001,Vente,109000,,,LE BOURG,B037,41700,41050,Cheverny,41,,,41050000AB0106,,,,,,,,,,,,,0,,,,,BT,taillis simples,,,1570,1.462452,47.501181
2020-601173,2020-12-17,000001,Vente,28000,,,PLAINE DES RASOIRS,B122,41700,41050,Cheverny,41,,,410500000E0193,,,,,,,,,,,,,0,,,,,BT,taillis simples,,,26397,1.428806,47.459788
2020-601173,2020-12-17,000001,Vente,28000,,,PLAINE DES RASOIRS,B122,41700,41050,Cheverny,41,,,410500000E0193,,,,,,,,,,,,,0,,,,,BR,futaies résineuses,,,13198,1.428806,47.459788
2020-601225,2020-12-11,000001,Vente,1000,,,LE VERGER,B155,41700,41050,Cheverny,41,,,410500000L0011,,,,,,,,,,,,,0,,,,,T,terres,,,3785,1.416088,47.497393
2020-601884,2020-12-18,000001,Vente,120000,,,L AVENTURE,B010,41700,41050,Cheverny,41,,,410500000L0485,,,,,,,,,,,,,0,,,,,T,terres,,,5505,1.417666,47.50485
2020-601884,2020-12-18,000001,Vente,120000,,,LA TALONNERIE,B145,41700,41050,Cheverny,41,,,410500000L0533,,,,,,,,,,,,,0,,,,,T,terres,,,380,1.417642,47.503578
2020-601884,2020-12-18,000001,Vente,120000,,,LA TALONNERIE,B145,41700,41050,Cheverny,41,,,410500000L0534,,,,,,,,,,,,,0,,,,,T,terres,,,820,1.417451,47.503623
2020-601884,2020-12-18,000001,Vente,120000,,,LA TALONNERIE,B145,41700,41050,Cheverny,41,,,410500000L0535,,,,,,,,,,,,,0,,,,,T,terres,,,3643,1.417223,47.504135
2020-601884,2020-12-18,000001,Vente,120000,,,LA TALONNERIE,B145,41700,41050,Cheverny,41,,,410500000L0536,,,,,,,,,,,,,0,,,,,E,eaux,MARE,Mare,490,1.416985,47.50472
2020-601884,2020-12-18,000001,Vente,120000,,,LA TALONNERIE,B145,41700,41050,Cheverny,41,,,410500000L0537,,,,,,,,,,,,,0,,,,,E,eaux,MARE,Mare,600,1.416712,47.504636
2020-601884,2020-12-18,000001,Vente,120000,,,LA TALONNERIE,B145,41700,41050,Cheverny,41,,,410500000L0538,,,,,,,,,,,,,0,,,,,T,terres,,,4370,1.416207,47.504513
2020-601884,2020-12-18,000001,Vente,120000,,,LA TALONNERIE,B145,41700,41050,Cheverny,41,,,410500000L0539,,,,,,,,,,,,,0,,,,,BT,taillis simples,,,1790,1.416442,47.503584
2020-601884,2020-12-18,000001,Vente,120000,,,LA TALONNERIE,B145,41700,41050,Cheverny,41,,,410500000L0539,,,,,,,,,,,,,0,,,,,T,terres,,,14528,1.416442,47.503584
2020-601884,2020-12-18,000001,Vente,120000,,,LA TALONNERIE,B145,41700,41050,Cheverny,41,,,410500000L0540,,,,,,,,,,,,,0,,,,,T,terres,,,8850,1.414332,47.503165
2020-601884,2020-12-18,000001,Vente,120000,,,LA TALONNERIE,B145,41700,41050,Cheverny,41,,,410500000L0541,,,,,,,,,,,,,0,,,,,T,terres,,,26985,1.414371,47.504417
2020-601884,2020-12-18,000001,Vente,120000,,,LA TALONNERIE,B145,41700,41050,Cheverny,41,,,410500000L0542,,,,,,,,,,,,,0,,,,,J,jardins,,,1648,1.414793,47.505006
2020-601884,2020-12-18,000001,Vente,120000,4,,VOIE DE LA TALONNERIE,0230,41700,41050,Cheverny,41,,,410500000L0543,,,,,,,,,,,,,0,1,Maison,81,4,S,sols,,,2722,1.414329,47.505147
2020-601884,2020-12-18,000001,Vente,120000,,,LA TALONNERIE,B145,41700,41050,Cheverny,41,,,410500000L0544,,,,,,,,,,,,,0,,,,,T,terres,,,22965,1.414788,47.505564
2020-601884,2020-12-18,000001,Vente,120000,,,LE GRAVIER,B082,41700,41050,Cheverny,41,,,410500000L0585,,,,,,,,,,,,,0,,,,,T,terres,,,10821,1.417043,47.505188
2020-601913,2020-12-21,000001,Vente,115000,200,A,LES RUAUX,B139,41700,41050,Cheverny,41,,,410500000K0433,,,,,,,,,,,,,0,1,Maison,65,4,S,sols,,,1000,1.434046,47.490475
2020-601913,2020-12-21,000001,Vente,115000,,,LES RUAUX,B139,41700,41050,Cheverny,41,,,410500000K0434,,,,,,,,,,,,,0,,,,,J,jardins,,,916,1.434184,47.490312
2020-602055,2020-12-30,000001,Vente,417000,3,,CHEM DE LA SOULARDIERE,0220,41700,41050,Cheverny,41,,,410500000L0374,,,,,,,,,,,,,0,1,Maison,120,10,S,sols,,,856,1.420908,47.492841
2020-602055,2020-12-30,000001,Vente,417000,,,LA RUE COLIN,B140,41700,41050,Cheverny,41,,,410500000L0720,,,,,,,,,,,,,0,,,,,VI,vignes,,,926,1.420846,47.493587
2020-602055,2020-12-30,000001,Vente,417000,,,LA RUE COLIN,B140,41700,41050,Cheverny,41,,,410500000L0722,,,,,,,,,,,,,0,,,,,S,sols,,,228,1.421238,47.493051
2020-602055,2020-12-30,000001,Vente,417000,,,LA RUE COLIN,B140,41700,41050,Cheverny,41,,,410500000L0722,,,,,,,,,,,,,0,,,,,T,terres,,,120,1.421238,47.493051
2020-602055,2020-12-30,000001,Vente,417000,,,LA RUE COLIN,B140,41700,41050,Cheverny,41,,,410500000L0786,,,,,,,,,,,,,0,,,,,J,jardins,,,1473,1.420807,47.493007
2020-602055,2020-12-30,000001,Vente,417000,1,,CHEM DE LA SOULARDIERE,0220,41700,41050,Cheverny,41,,,410500000L0788,,,,,,,,,,,,,0,,,,,AG,terrains d'agrément,,,64,1.420743,47.493242
2020-602055,2020-12-30,000001,Vente,417000,1,,CHEM DE LA SOULARDIERE,0220,41700,41050,Cheverny,41,,,410500000L0804,,,,,,,,,,,,,0,,,,,AG,terrains d'agrément,,,346,1.420749,47.493298
2020-602096,2020-12-23,000001,Vente,1720,,,LE VOU,B159,41700,41050,Cheverny,41,,,410500000G0255,,,,,,,,,,,,,0,,,,,T,terres,,,2880,1.414041,47.483313
2020-602096,2020-12-23,000001,Vente,1720,,,LE VOU,B159,41700,41050,Cheverny,41,,,410500000G0255,,,,,,,,,,,,,0,,,,,T,terres,,,2881,1.414041,47.483313
2020-602112,2020-05-27,000001,Vente,276900,4,,CHEM DES BISOLLIERES,0105,41700,41050,Cheverny,41,,,410500000L0635,,,,,,,,,,,,,0,1,Maison,140,4,AG,terrains d'agrément,,,3350,1.430115,47.502632
2020-602112,2020-05-27,000001,Vente,276900,4,,CHEM DES BISOLLIERES,0105,41700,41050,Cheverny,41,,,410500000L0635,,,,,,,,,,,,,0,1,Maison,140,4,S,sols,,,1560,1.430115,47.502632
2020-602112,2020-05-27,000001,Vente,276900,4,,CHEM DES BISOLLIERES,0105,41700,41050,Cheverny,41,,,410500000L0635,,,,,,,,,,,,,0,1,Maison,140,4,BP,peupleraies,,,1670,1.430115,47.502632
2020-602112,2020-05-27,000001,Vente,276900,4,,CHEM DES BISOLLIERES,0105,41700,41050,Cheverny,41,,,410500000L0635,,,,,,,,,,,,,0,1,Maison,140,4,J,jardins,,,1480,1.430115,47.502632
2020-602112,2020-05-27,000001,Vente,276900,4,,CHEM DES BISOLLIERES,0105,41700,41050,Cheverny,41,,,410500000L0635,,,,,,,,,,,,,0,1,Maison,140,4,AG,terrains d'agrément,,,1200,1.430115,47.502632
