id_mutation,date_mutation,numero_disposition,nature_mutation,valeur_fonciere,adresse_numero,adresse_suffixe,adresse_nom_voie,adresse_code_voie,code_postal,code_commune,nom_commune,code_departement,ancien_code_commune,ancien_nom_commune,id_parcelle,ancien_id_parcelle,numero_volume,lot1_numero,lot1_surface_carrez,lot2_numero,lot2_surface_carrez,lot3_numero,lot3_surface_carrez,lot4_numero,lot4_surface_carrez,lot5_numero,lot5_surface_carrez,nombre_lots,code_type_local,type_local,surface_reelle_bati,nombre_pieces_principales,code_nature_culture,nature_culture,code_nature_culture_speciale,nature_culture_speciale,surface_terrain,longitude,latitude
2020-595834,2020-04-17,000001,Vente,78000,9,B,RTE DU MANOIR,0139,41140,41132,Méhers,41,,,411320000E0360,,,,,,,,,,,,,0,1,Maison,58,2,S,sols,,,589,1.427326,47.322187
2020-596080,2020-05-07,000001,Vente,71000,,,MONTCHENU,B054,41140,41132,Méhers,41,,,411320000A0641,,,,,,,,,,,,,0,,,,,T,terres,,,1181,1.455321,47.331721
2020-596080,2020-05-07,000001,Vente,71000,14,,RTE DE SAINT CLAIR,0160,41140,41132,Méhers,41,,,411320000A0643,,,,,,,,,,,,,0,1,Maison,100,4,S,sols,,,405,1.455394,47.331491
2020-596762,2020-06-12,000002,Vente,16500,,,LES COSSES DE MONTCHENU,B024,41140,41132,Méhers,41,,,411320000A1268,,,,,,,,,,,,,0,,,,,T,terres,,,1406,1.452284,47.330637
2020-597018,2020-06-23,000001,Vente,6182,,,LE BAS DE L ETANG,B004,41140,41132,Méhers,41,,,41132000ZB0058,,,,,,,,,,,,,0,,,,,BP,peupleraies,,,14075,1.454094,47.325301
2020-597018,2020-06-23,000001,Vente,6182,,,LE BAS DE L ETANG,B004,41140,41132,Méhers,41,,,41132000ZB0058,,,,,,,,,,,,,0,,,,,BT,taillis simples,,,14075,1.454094,47.325301
2020-597019,2020-06-23,000001,Vente,23478,,,LE BOURG,B012,41140,41132,Méhers,41,,,41132000ZD0001,,,,,,,,,,,,,0,,,,,T,terres,,,7660,1.457596,47.326889
2020-597019,2020-06-23,000001,Vente,23478,90,A,LE BOURG EST,B013,41140,41132,Méhers,41,,,41132000ZD0007,,,,,,,,,,,,,0,4,Local industriel. commercial ou assimilé,,0,T,terres,,,34813,1.461592,47.326239
2020-597019,2020-06-23,000001,Vente,23478,90,A,LE BOURG EST,B013,41140,41132,Méhers,41,,,41132000ZD0007,,,,,,,,,,,,,0,4,Local industriel. commercial ou assimilé,,0,L,landes,,,6600,1.461592,47.326239
2020-597019,2020-06-23,000001,Vente,23478,,,LE BOURG,B012,41140,41132,Méhers,41,,,41132000ZD0013,,,,,,,,,,,,,0,,,,,T,terres,,,41336,1.463779,47.324019
2020-597020,2020-06-23,000001,Vente,14500,,,ETANG DE SOUDUN,B034,41140,41132,Méhers,41,,,41132000ZC0036,,,,,,,,,,,,,0,,,,,T,terres,,,27385,1.452908,47.323505
2020-597020,2020-06-23,000001,Vente,14500,,,ETANG DE SOUDUN,B034,41140,41132,Méhers,41,,,41132000ZC0036,,,,,,,,,,,,,0,,,,,BT,taillis simples,,,27385,1.452908,47.323505
2020-597380,2020-07-07,000001,Vente,12880,,,PLAINE DE LA GARENNE,B074,41140,41132,Méhers,41,,,41132000ZE0073,,,,,,,,,,,,,0,,,,,T,terres,,,43004,1.473709,47.331055
2020-598428,2020-08-20,000001,Echange,500,,,LES COLASSIERES,B021,41140,41132,Méhers,41,,,41132000ZN0044,,,,,,,,,,,,,0,,,,,BR,futaies résineuses,,,5116,1.437521,47.337475
2020-598428,2020-08-20,000002,Echange,500,,,LA PETITE FOURRELLIERE,B064,41140,41132,Méhers,41,,,41132000ZM0080,,,,,,,,,,,,,0,,,,,VI,vignes,,,1797,1.435935,47.343091
2020-599975,2020-10-27,000001,Vente,55000,,,BEAUCHENE,B006,41140,41132,Méhers,41,,,411320000B0133,,,,,,,,,,,,,0,,,,,BT,taillis simples,,,2700,1.443339,47.348452
2020-599975,2020-10-27,000001,Vente,55000,15,,RTE DE SAINT CLAIR,0160,41140,41132,Méhers,41,,,411320000B0138,,,,,,,,,,,,,0,1,Maison,100,4,J,jardins,,,1001,1.441493,47.347998
2020-599975,2020-10-27,000001,Vente,55000,15,,RTE DE SAINT CLAIR,0160,41140,41132,Méhers,41,,,411320000B0138,,,,,,,,,,,,,0,1,Maison,100,4,S,sols,,,800,1.441493,47.347998
2020-599975,2020-10-27,000001,Vente,55000,,,BEAUCHENE,B006,41140,41132,Méhers,41,,,411320000B0139,,,,,,,,,,,,,0,,,,,P,prés,,,1096,1.441887,47.347796
2020-599975,2020-10-27,000001,Vente,55000,,,BEAUCHENE,B006,41140,41132,Méhers,41,,,411320000B0142,,,,,,,,,,,,,0,,,,,BR,futaies résineuses,,,12700,1.443979,47.348087
2020-599975,2020-10-27,000001,Vente,55000,,,BEAUCHENE,B006,41140,41132,Méhers,41,,,411320000B0147,,,,,,,,,,,,,0,,,,,BR,futaies résineuses,,,3500,1.447403,47.349515
2020-599975,2020-10-27,000001,Vente,55000,,,BEAUCHENE,B006,41140,41132,Méhers,41,,,411320000B0147,,,,,,,,,,,,,0,,,,,VI,vignes,,,300,1.447403,47.349515
2020-599975,2020-10-27,000001,Vente,55000,,,PRAIRIE DU GUE DU MATIN,B082,41140,41132,Méhers,41,,,41132000ZA0042,,,,,,,,,,,,,0,,,,,P,prés,,,1562,1.437044,47.32656
2020-599975,2020-10-27,000001,Vente,55000,,,BEAUCHENE,B006,41140,41132,Méhers,41,,,41132000ZK0084,,,,,,,,,,,,,0,,,,,BT,taillis simples,,,9099,1.442372,47.347988
2020-600838,2020-11-26,000001,Vente,164000,20,,RTE DES FONTAINES,0109,41140,41132,Méhers,41,,,41132000ZB0098,,,,,,,,,,,,,0,1,Maison,111,4,S,sols,,,800,1.45061,47.330167
2020-600838,2020-11-26,000001,Vente,164000,20,,RTE DES FONTAINES,0109,41140,41132,Méhers,41,,,41132000ZB0098,,,,,,,,,,,,,0,1,Maison,111,4,AG,terrains d'agrément,,,3261,1.45061,47.330167
