id_mutation,date_mutation,numero_disposition,nature_mutation,valeur_fonciere,adresse_numero,adresse_suffixe,adresse_nom_voie,adresse_code_voie,code_postal,code_commune,nom_commune,code_departement,ancien_code_commune,ancien_nom_commune,id_parcelle,ancien_id_parcelle,numero_volume,lot1_numero,lot1_surface_carrez,lot2_numero,lot2_surface_carrez,lot3_numero,lot3_surface_carrez,lot4_numero,lot4_surface_carrez,lot5_numero,lot5_surface_carrez,nombre_lots,code_type_local,type_local,surface_reelle_bati,nombre_pieces_principales,code_nature_culture,nature_culture,code_nature_culture_speciale,nature_culture_speciale,surface_terrain,longitude,latitude
2020-615400,2020-01-23,000001,Vente,114080,5020,,LE BOURG,B004,42510,42226,Saint-Georges-de-Baroille,42,,,422260000B1614,,,,,,,,,,,,,0,1,Maison,90,3,S,sols,,,501,4.131469,45.849005
2020-615766,2020-03-10,000001,Vente,1500,,,LES PLANCHETTES,B024,42510,42226,Saint-Georges-de-Baroille,42,,,422260000B0682,,,,,,,,,,,,,0,,,,,BT,taillis simples,,,4870,4.114399,45.840341
2020-615812,2020-03-06,000001,Vente,1173,,,LES MARCILLERES,B019,42510,42226,Saint-Georges-de-Baroille,42,,,422260000A1232,,,,,,,,,,,,,0,,,,,P,prés,,,1396,4.120964,45.859534
2020-615812,2020-03-06,000001,Vente,1173,,,LARD,B018,42510,42226,Saint-Georges-de-Baroille,42,,,422260000A1234,,,,,,,,,,,,,0,,,,,P,prés,,,1537,4.120793,45.859743
2020-615873,2020-03-06,000002,Echange,18000,,,BAROILLES,B001,42510,42226,Saint-Georges-de-Baroille,42,,,422260000A1237,,,,,,,,,,,,,0,,,,,PA,pâtures,PATUR,Pâture plantée,3187,4.102396,45.865629
2020-615873,2020-03-06,000002,Echange,18000,,,COLONGES,B010,42510,42226,Saint-Georges-de-Baroille,42,,,422260000A1239,,,,,,,,,,,,,0,,,,,BS,taillis sous futaie,,,4171,4.103666,45.864824
2020-615873,2020-03-06,000002,Echange,18000,,,COLONGES,B010,42510,42226,Saint-Georges-de-Baroille,42,,,422260000A1241,,,,,,,,,,,,,0,,,,,BT,taillis simples,,,32935,4.10446,45.863511
2020-615873,2020-03-06,000002,Echange,18000,,,BAROILLES,B001,42510,42226,Saint-Georges-de-Baroille,42,,,422260000A1243,,,,,,,,,,,,,0,,,,,BS,taillis sous futaie,,,5887,4.101787,45.862492
2020-615873,2020-03-06,000002,Echange,18000,,,LES BROSSES,B005,42510,42226,Saint-Georges-de-Baroille,42,,,422260000A1247,,,,,,,,,,,,,0,,,,,BS,taillis sous futaie,,,13916,4.100503,45.859675
2020-615873,2020-03-06,000003,Echange,18000,,,LES BROSSES,B005,42510,42226,Saint-Georges-de-Baroille,42,,,422260000A0957,,,,,,,,,,,,,0,,,,,BS,taillis sous futaie,,,24490,4.098474,45.857344
2020-615873,2020-03-06,000003,Echange,18000,,,BAROILLES,B001,42510,42226,Saint-Georges-de-Baroille,42,,,422260000A1245,,,,,,,,,,,,,0,,,,,BS,taillis sous futaie,,,4612,4.099546,45.861351
2020-615873,2020-03-06,000003,Echange,18000,,,LES BROSSES,B005,42510,42226,Saint-Georges-de-Baroille,42,,,422260000A1249,,,,,,,,,,,,,0,,,,,BS,taillis sous futaie,,,30480,4.100865,45.856986
2020-615873,2020-03-06,000003,Echange,18000,,,LES BROSSES,B005,42510,42226,Saint-Georges-de-Baroille,42,,,422260000A1251,,,,,,,,,,,,,0,,,,,BS,taillis sous futaie,,,496,4.099696,45.860996
2020-615874,2020-03-06,000001,Vente,864,,,LES MARCILLERES,B019,42510,42226,Saint-Georges-de-Baroille,42,,,422260000A1233,,,,,,,,,,,,,0,,,,,S,sols,,,1068,4.116508,45.863307
2020-615874,2020-03-06,000001,Vente,864,,,LARD,B018,42510,42226,Saint-Georges-de-Baroille,42,,,422260000A1235,,,,,,,,,,,,,0,,,,,S,sols,,,1091,4.11651,45.86331
2020-615874,2020-03-06,000002,Vente,864,,,GROS BUISSON,B017,42510,42226,Saint-Georges-de-Baroille,42,,,422260000B1266,,,,,,,,,,,,,0,,,,,P,prés,,,1085,4.129668,45.852388
2020-616963,2020-07-17,000001,Vente,168000,22,,IMP DES COTEAUX,0048,42510,42226,Saint-Georges-de-Baroille,42,,,422260000A1089,,,,,,,,,,,,,0,1,Maison,89,2,S,sols,,,1053,4.128522,45.85709
2020-616963,2020-07-17,000001,Vente,168000,,,LARD,B018,42510,42226,Saint-Georges-de-Baroille,42,,,422260000A1091,,,,,,,,,,,,,0,,,,,T,terres,,,625,4.128378,45.857151
2020-616963,2020-07-17,000001,Vente,168000,,,LARD,B018,42510,42226,Saint-Georges-de-Baroille,42,,,422260000A1093,,,,,,,,,,,,,0,,,,,P,prés,,,1624,4.128634,45.857117
2020-617182,2020-08-05,000001,Vente,150000,,,LES COUARNES,B012,42510,42226,Saint-Georges-de-Baroille,42,,,422260000B0269,,,,,,,,,,,,,0,,,,,S,sols,,,970,4.127781,45.847397
2020-617182,2020-08-05,000001,Vente,150000,5072,A,LES COUARNES,B012,42510,42226,Saint-Georges-de-Baroille,42,,,422260000B1217,,,,,,,,,,,,,0,1,Maison,60,2,S,sols,,,684,4.127483,45.847272
2020-617182,2020-08-05,000001,Vente,150000,5072,A,LES COUARNES,B012,42510,42226,Saint-Georges-de-Baroille,42,,,422260000B1217,,,,,,,,,,,,,0,1,Maison,102,4,S,sols,,,684,4.127483,45.847272
2020-617182,2020-08-05,000001,Vente,150000,5072,A,LES COUARNES,B012,42510,42226,Saint-Georges-de-Baroille,42,,,422260000B1217,,,,,,,,,,,,,0,1,Maison,60,2,P,prés,,,1500,4.127483,45.847272
2020-617182,2020-08-05,000001,Vente,150000,5072,A,LES COUARNES,B012,42510,42226,Saint-Georges-de-Baroille,42,,,422260000B1217,,,,,,,,,,,,,0,1,Maison,102,4,P,prés,,,1500,4.127483,45.847272
2020-617188,2020-08-27,000001,Vente,1000,,,LARD,B018,42510,42226,Saint-Georges-de-Baroille,42,,,422260000A0893,,,,,,,,,,,,,0,,,,,PA,pâtures,PATUR,Pâture plantée,3960,4.129908,45.866755
2020-617188,2020-08-27,000001,Vente,1000,,,LARD,B018,42510,42226,Saint-Georges-de-Baroille,42,,,422260000A0894,,,,,,,,,,,,,0,,,,,PA,pâtures,PATUR,Pâture plantée,160,4.129969,45.86627
2020-617313,2020-09-10,000001,Vente,85000,,,LES BRUYERES,B006,42510,42226,Saint-Georges-de-Baroille,42,,,422260000A0662,,,,,,,,,,,,,0,,,,,T,terres,,,41070,4.072305,45.856515
2020-617313,2020-09-10,000001,Vente,85000,,,LA CROIX ROUILLEE,B014,42510,42226,Saint-Georges-de-Baroille,42,,,422260000A1021,,,,,,,,,,,,,0,,,,,P,prés,,,41148,4.068509,45.864298
2020-617313,2020-09-10,000001,Vente,85000,,,LES BRUYERES,B006,42510,42226,Saint-Georges-de-Baroille,42,,,422260000A1036,,,,,,,,,,,,,0,,,,,P,prés,,,6122,4.081484,45.858839
2020-617313,2020-09-10,000001,Vente,85000,,,LES BRUYERES,B006,42510,42226,Saint-Georges-de-Baroille,42,,,422260000A1038,,,,,,,,,,,,,0,,,,,P,prés,,,15608,4.081712,45.858777
2020-617313,2020-09-10,000001,Vente,85000,,,LA CROIX ROUILLEE,B014,42510,42226,Saint-Georges-de-Baroille,42,,,422260000A1255,,,,,,,,,,,,,0,,,,,P,prés,,,14032,4.070149,45.864198
2020-617313,2020-09-10,000001,Vente,85000,,,LES BRUYERES,B006,42510,42226,Saint-Georges-de-Baroille,42,,,42226000ZA0004,,,,,,,,,,,,,0,,,,,P,prés,,,28795,4.076022,45.85422
2020-617313,2020-09-10,000001,Vente,85000,,,LES BRUYERES,B006,42510,42226,Saint-Georges-de-Baroille,42,,,42226000ZA0004,,,,,,,,,,,,,0,,,,,T,terres,,,28795,4.076022,45.85422
2020-617317,2020-09-10,000001,Vente,90000,,,LA CROIX ROUILLEE,B014,42510,42226,Saint-Georges-de-Baroille,42,,,422260000A0668,,,,,,,,,,,,,0,,,,,PA,pâtures,PATUR,Pâture plantée,6775,4.069591,45.865033
2020-617317,2020-09-10,000001,Vente,90000,1202,,RTE DE LA CROIX ROUILLEE,0054,42510,42226,Saint-Georges-de-Baroille,42,,,422260000A1060,,,,,,,,,,,,,0,1,Maison,90,3,S,sols,,,2000,4.068867,45.86466
2020-617317,2020-09-10,000001,Vente,90000,1202,,RTE DE LA CROIX ROUILLEE,0054,42510,42226,Saint-Georges-de-Baroille,42,,,422260000A1060,,,,,,,,,,,,,0,1,Maison,90,3,J,jardins,,,1562,4.068867,45.86466
2020-617448,2020-09-02,000001,Vente,217000,,,BORNILLON,B003,42510,42226,Saint-Georges-de-Baroille,42,,,422260000B0068,,,,,,,,,,,,,0,,,,,P,prés,,,4460,4.1128,45.847771
2020-617448,2020-09-02,000001,Vente,217000,,,LE CREUX DU LOUP,B013,42510,42226,Saint-Georges-de-Baroille,42,,,422260000B0188,,,,,,,,,,,,,0,,,,,S,sols,,,60,4.114145,45.847371
2020-617448,2020-09-02,000001,Vente,217000,,,LE CREUX DU LOUP,B013,42510,42226,Saint-Georges-de-Baroille,42,,,422260000B0189,,,,,,,,,,,,,0,,,,,P,prés,,,1520,4.113979,45.847261
2020-617448,2020-09-02,000001,Vente,217000,,,LE CREUX DU LOUP,B013,42510,42226,Saint-Georges-de-Baroille,42,,,422260000B0190,,,,,,,,,,,,,0,,,,,P,prés,,,2400,4.114154,45.847171
2020-617448,2020-09-02,000001,Vente,217000,356,,CHE DES CHEVREUILS,0039,42510,42226,Saint-Georges-de-Baroille,42,,,422260000B1405,,,,,,,,,,,,,0,1,Maison,228,7,S,sols,,,2265,4.114224,45.847632
2020-617448,2020-09-02,000001,Vente,217000,356,,CHE DES CHEVREUILS,0039,42510,42226,Saint-Georges-de-Baroille,42,,,422260000B1405,,,,,,,,,,,,,0,1,Maison,228,7,P,prés,,,10680,4.114224,45.847632
2020-617448,2020-09-02,000001,Vente,217000,,,BORNILLON,B003,42510,42226,Saint-Georges-de-Baroille,42,,,422260000B1609,,,,,,,,,,,,,0,,,,,P,prés,,,5219,4.111574,45.847639
2020-617925,2020-10-12,000001,Vente,124000,645,,RTE DE PIERRE BLEUE,0123,42510,42226,Saint-Georges-de-Baroille,42,,,422260000B1406,,,,,,,,,,,,,0,1,Maison,90,3,S,sols,,,500,4.124829,45.844543
2020-617925,2020-10-12,000001,Vente,124000,645,,RTE DE PIERRE BLEUE,0123,42510,42226,Saint-Georges-de-Baroille,42,,,422260000B1406,,,,,,,,,,,,,0,1,Maison,90,3,J,jardins,,,1507,4.124829,45.844543
2020-618309,2020-11-12,000001,Vente,224250,58,,RUE DE LA LOIRE,0099,42510,42226,Saint-Georges-de-Baroille,42,,,422260000B1590,,,,,,,,,,,,,0,1,Maison,90,3,S,sols,,,945,4.132457,45.849398
2020-618872,2020-08-05,000001,Vente,35000,,,LARD,B018,42510,42226,Saint-Georges-de-Baroille,42,,,422260000A0421,,,,,,,,,,,,,0,,,,,P,prés,,,3070,4.122831,45.859484
2020-618872,2020-08-05,000001,Vente,35000,,,LARD,B018,42510,42226,Saint-Georges-de-Baroille,42,,,422260000A1256,,,,,,,,,,,,,0,,,,,VI,vignes,,,1635,4.122785,45.858961
2020-618872,2020-08-05,000001,Vente,35000,,,LARD,B018,42510,42226,Saint-Georges-de-Baroille,42,,,422260000A1258,,,,,,,,,,,,,0,,,,,P,prés,,,7893,4.121921,45.859426
2020-618872,2020-08-05,000001,Vente,35000,,,LARD,B018,42510,42226,Saint-Georges-de-Baroille,42,,,422260000A1259,,,,,,,,,,,,,0,,,,,S,sols,,,1000,4.123481,45.859337
2020-618872,2020-08-05,000001,Vente,35000,,,LARD,B018,42510,42226,Saint-Georges-de-Baroille,42,,,422260000A1259,,,,,,,,,,,,,0,,,,,P,prés,,,2562,4.123481,45.859337
2020-618873,2020-08-05,000001,Vente,205000,,,LARD,B018,42510,42226,Saint-Georges-de-Baroille,42,,,422260000A0416,,,,,,,,,,,,,0,,,,,P,prés,,,16500,4.121959,45.860095
2020-618873,2020-08-05,000001,Vente,205000,,,LARD,B018,42510,42226,Saint-Georges-de-Baroille,42,,,422260000A0417,,,,,,,,,,,,,0,,,,,J,jardins,,,670,4.1226,45.860318
2020-618873,2020-08-05,000001,Vente,205000,,,LARD,B018,42510,42226,Saint-Georges-de-Baroille,42,,,422260000A0418,,,,,,,,,,,,,0,,,,,T,terres,,,13240,4.122937,45.860309
2020-618873,2020-08-05,000001,Vente,205000,196,,RTE DES POTIERS,0129,42510,42226,Saint-Georges-de-Baroille,42,,,422260000A0419,,,,,,,,,,,,,0,4,Local industriel. commercial ou assimilé,130,0,S,sols,,,1560,4.122908,45.85997
2020-618873,2020-08-05,000001,Vente,205000,196,,RTE DES POTIERS,0129,42510,42226,Saint-Georges-de-Baroille,42,,,422260000A0419,,,,,,,,,,,,,0,3,Dépendance,,0,S,sols,,,1560,4.122908,45.85997
2020-618873,2020-08-05,000001,Vente,205000,196,,RTE DES POTIERS,0129,42510,42226,Saint-Georges-de-Baroille,42,,,422260000A0419,,,,,,,,,,,,,0,1,Maison,130,4,S,sols,,,1560,4.122908,45.85997
2020-618873,2020-08-05,000001,Vente,205000,,,LARD,B018,42510,42226,Saint-Georges-de-Baroille,42,,,422260000A0420,,,,,,,,,,,,,0,,,,,S,sols,,,160,4.122978,45.859641
