id_mutation,date_mutation,numero_disposition,nature_mutation,valeur_fonciere,adresse_numero,adresse_suffixe,adresse_nom_voie,adresse_code_voie,code_postal,code_commune,nom_commune,code_departement,ancien_code_commune,ancien_nom_commune,id_parcelle,ancien_id_parcelle,numero_volume,lot1_numero,lot1_surface_carrez,lot2_numero,lot2_surface_carrez,lot3_numero,lot3_surface_carrez,lot4_numero,lot4_surface_carrez,lot5_numero,lot5_surface_carrez,nombre_lots,code_type_local,type_local,surface_reelle_bati,nombre_pieces_principales,code_nature_culture,nature_culture,code_nature_culture_speciale,nature_culture_speciale,surface_terrain,longitude,latitude
2020-669330,2020-11-06,000001,Vente,90000,,,LA VILLE,B017,45270,45031,Bellegarde,45,,,45031000AC0078,,,,,,,,,,,,,0,,,,,J,jardins,,,533,2.4438,47.992279
2020-669330,2020-11-06,000001,Vente,90000,18,,RUE DES ESTIVAUX,0310,45270,45031,Bellegarde,45,,,45031000AC0079,,,,,,,,,,,,,0,1,Maison,140,6,S,sols,,,520,2.443478,47.992469
2020-669337,2020-11-06,000001,Vente,92000,20,,LES POLICETTES,B013,45270,45031,Bellegarde,45,,,45031000AB0251,,,14,,3,,38,,39,,,,4,1,Maison,64,3,,,,,,2.451904,47.993548
2020-670272,2020-11-23,000001,Vente,65000,,,LA VILLE,B017,45270,45031,Bellegarde,45,,,45031000AD0263,,,,,,,,,,,,,0,,,,,J,jardins,,,290,2.438983,47.986947
2020-670272,2020-11-23,000001,Vente,65000,,,RUE ORLEANAISE,0580,45270,45031,Bellegarde,45,,,45031000AD0264,,,,,,,,,,,,,0,,,,,S,sols,,,41,2.439077,47.986824
2020-670272,2020-11-23,000001,Vente,65000,28,,RUE ORLEANAISE,0580,45270,45031,Bellegarde,45,,,45031000AD0265,,,,,,,,,,,,,0,1,Maison,73,2,S,sols,,,119,2.439157,47.986746
2020-670272,2020-11-23,000001,Vente,65000,,,LA VILLE,B017,45270,45031,Bellegarde,45,,,45031000AD0500,,,,,,,,,,,,,0,,,,,S,sols,,,26,2.439249,47.986752
2020-670272,2020-11-23,000001,Vente,65000,,,LA VILLE,B017,45270,45031,Bellegarde,45,,,45031000AD0581,,,,,,,,,,,,,0,,,,,S,sols,,,3,2.439217,47.986798
2020-670272,2020-11-23,000001,Vente,65000,,,LA VILLE,B017,45270,45031,Bellegarde,45,,,45031000AD0583,,,,,,,,,,,,,0,,,,,S,sols,,,6,2.439204,47.986794
2020-670272,2020-11-23,000001,Vente,65000,,,LA VILLE,B017,45270,45031,Bellegarde,45,,,45031000AD0584,,,,,,,,,,,,,0,,,,,S,sols,,,39,2.439156,47.986802
2020-671501,2020-12-04,000001,Vente,92000,,,QUARTIER DU CHATEAU,B018,45270,45031,Bellegarde,45,,,45031000AE0092,,,,,,,,,,,,,0,,,,,J,jardins,,,560,,
2020-671501,2020-12-04,000001,Vente,92000,10,,ALL DU CHATEAU,0180,45270,45031,Bellegarde,45,,,45031000AE0093,,,,,,,,,,,,,0,1,Maison,60,3,S,sols,,,210,,
2020-671674,2020-12-23,000001,Vente,215000,,,LES GRISARDIERES,B007,45270,45031,Bellegarde,45,,,45031000AC0039,,,,,,,,,,,,,0,,,,,J,jardins,,,503,2.440422,47.990885
2020-671674,2020-12-23,000001,Vente,215000,44,,RUE DE LA REPUBLIQUE,0660,45270,45031,Bellegarde,45,,,45031000AC0040,,,,,,,,,,,,,0,1,Maison,115,4,S,sols,,,554,2.440309,47.990672
2020-671674,2020-12-23,000001,Vente,215000,44,,RUE DE LA REPUBLIQUE,0660,45270,45031,Bellegarde,45,,,45031000AC0040,,,,,,,,,,,,,0,1,Maison,50,1,S,sols,,,554,2.440309,47.990672
2020-674718,2020-02-07,000001,Vente,97900,20,,LES POLICETTES,B013,45270,45031,Bellegarde,45,,,45031000AB0251,,,16,,32,,33,,6,,,,4,1,Maison,65,3,,,,,,2.451904,47.993548
2020-674734,2020-02-17,000001,Vente,85000,28,,AV DU 21 AOUT 1944,0030,45270,45031,Bellegarde,45,,,45031000AD0290,,,,,,,,,,,,,0,4,Local industriel. commercial ou assimilé,30,0,S,sols,,,130,2.440248,47.986845
2020-674734,2020-02-17,000001,Vente,85000,28,,AV DU 21 AOUT 1944,0030,45270,45031,Bellegarde,45,,,45031000AD0290,,,,,,,,,,,,,0,1,Maison,58,4,S,sols,,,130,2.440248,47.986845
2020-674752,2020-02-13,000001,Vente,80666.96,9,,ALL DES FOSSARDIERES,0318,45270,45031,Bellegarde,45,,,45031000AC0325,,,,,,,,,,,,,0,1,Maison,96,4,S,sols,,,971,2.441633,47.992945
2020-674752,2020-02-13,000001,Vente,80666.96,,,LES FOSSARDIERES,B005,45270,45031,Bellegarde,45,,,45031000AC0327,,,,,,,,,,,,,0,,,,,S,sols,,,107,2.441676,47.993053
2020-674792,2020-02-18,000001,Vente,102000,,,LES FOSSARDIERES,B005,45270,45031,Bellegarde,45,,,45031000AC0051,,,,,,,,,,,,,0,,,,,S,sols,,,158,2.44085,47.991023
2020-674792,2020-02-18,000001,Vente,102000,8,,ALL FLANDRES DUNKERQUE 1940,0313,45270,45031,Bellegarde,45,,,45031000AC0254,,,,,,,,,,,,,0,1,Maison,99,4,S,sols,,,300,2.440841,47.99093
2020-674792,2020-02-18,000001,Vente,102000,,,LES FOSSARDIERES,B005,45270,45031,Bellegarde,45,,,45031000AC0255,,,,,,,,,,,,,0,,,,,S,sols,,,1,2.440855,47.990927
2020-675020,2020-03-05,000001,Vente,88000,20,,LES POLICETTES,B013,45270,45031,Bellegarde,45,,,45031000AB0251,,,19,,26,,27,,9,66.73,,,4,1,Maison,64,3,,,,,,2.451904,47.993548
2020-675026,2020-03-11,000001,Vente,133500,6,,AV MADAME DE MONTESPAN,0490,45270,45031,Bellegarde,45,,,45031000AH0102,,,,,,,,,,,,,0,1,Maison,105,4,S,sols,,,684,,
2020-675026,2020-03-11,000001,Vente,133500,,,TERRES DU CHATEAU,B015,45270,45031,Bellegarde,45,,,45031000AH0219,,,,,,,,,,,,,0,,,,,AB,terrains a bâtir,,,95,,
2020-675129,2020-04-29,000001,Vente,300000,12,,RUE DEMERSAY,0300,45270,45031,Bellegarde,45,,,45031000AB0004,,,,,,,,,,,,,0,4,Local industriel. commercial ou assimilé,170,0,S,sols,,,415,2.44321,47.98897
2020-675129,2020-04-29,000001,Vente,300000,12,,RUE DEMERSAY,0300,45270,45031,Bellegarde,45,,,45031000AB0004,,,,,,,,,,,,,0,1,Maison,120,5,S,sols,,,415,2.44321,47.98897
2020-675231,2020-05-15,000001,Vente,148000,,,LA VILLE,B017,45270,45031,Bellegarde,45,,,45031000AC0119,,,,,,,,,,,,,0,,,,,J,jardins,,,375,,
2020-675231,2020-05-15,000001,Vente,148000,5175,,AV DU CHANOINE DANTHON,0090,45270,45031,Bellegarde,45,,,45031000AC0120,,,,,,,,,,,,,0,1,Maison,30,1,S,sols,,,496,,
2020-675231,2020-05-15,000001,Vente,148000,5175,,AV DU CHANOINE DANTHON,0090,45270,45031,Bellegarde,45,,,45031000AC0120,,,,,,,,,,,,,0,1,Maison,140,4,S,sols,,,496,,
2020-675287,2020-05-29,000001,Vente,160000,1,,ALL DES FOSSARDIERES,0318,45270,45031,Bellegarde,45,,,45031000AC0303,,,,,,,,,,,,,0,1,Maison,122,5,S,sols,,,688,2.440844,47.992236
2020-675288,2020-05-29,000001,Vente,200000,28,,AV MADAME DE MONTESPAN,0490,45270,45031,Bellegarde,45,,,45031000AH0536,,,,,,,,,,,,,0,1,Maison,130,7,S,sols,,,1005,2.449669,47.986197
2020-675331,2020-05-25,000001,Vente,60000,2,,LES POLICETTES,B013,45270,45031,Bellegarde,45,,,45031000AB0179,,,,,,,,,,,,,0,1,Maison,55,2,S,sols,,,217,2.450012,47.994523
2020-675331,2020-05-25,000001,Vente,60000,,,LES POLICETTES,B013,45270,45031,Bellegarde,45,,,45031000AB0183,,,,,,,,,,,,,0,,,,,J,jardins,,,254,2.449908,47.994423
2020-675574,2020-03-05,000001,Vente,280000,5,,ZONE INDUSTR DE BELLEGARDE,B025,45270,45031,Bellegarde,45,,,45031000AH0079,,,,,,,,,,,,,0,4,Local industriel. commercial ou assimilé,2605,0,S,sols,,,2605,2.453836,47.992019
2020-675574,2020-03-05,000001,Vente,280000,3,B,ZONE INDUSTR DE BELLEGARDE,B025,45270,45031,Bellegarde,45,,,45031000AH0222,,,,,,,,,,,,,0,4,Local industriel. commercial ou assimilé,3702,0,S,sols,,,3702,2.453602,47.992296
2020-675778,2020-07-10,000001,Vente,85000,12,,AV NICOLAS BRAQUE,0530,45270,45031,Bellegarde,45,,,45031000AH0124,,,,,,,,,,,,,0,1,Maison,108,4,S,sols,,,134,2.446724,47.988252
2020-675778,2020-07-10,000001,Vente,85000,,,PRAIRIE DE BELLEGARDE,B014,45270,45031,Bellegarde,45,,,45031000AH0182,,,,,,,,,,,,,0,,,,,S,sols,,,67,2.446919,47.988256
2020-675799,2020-07-08,000001,Vente,87500,22,,LES POLICETTES,B013,45270,45031,Bellegarde,45,,,45031000AB0292,,,,,,,,,,,,,0,4,Local industriel. commercial ou assimilé,254,0,S,sols,,,500,2.453156,47.993886
2020-675799,2020-07-08,000001,Vente,87500,22,,LES POLICETTES,B013,45270,45031,Bellegarde,45,,,45031000AB0292,,,,,,,,,,,,,0,4,Local industriel. commercial ou assimilé,254,0,AG,terrains d'agrément,,,2748,2.453156,47.993886
2020-675991,2020-08-11,000001,Vente,70000,5,,ALL FLANDRES DUNKERQUE 1940,0313,45270,45031,Bellegarde,45,,,45031000AC0033,,,,,,,,,,,,,0,1,Maison,90,4,S,sols,,,570,2.440265,47.99134
2020-675993,2020-08-21,000001,Vente,71000,42,,RUE DEMERSAY,0300,45270,45031,Bellegarde,45,,,45031000AB0049,,,,,,,,,,,,,0,1,Maison,92,4,S,sols,,,286,2.444085,47.990207
2020-676017,2020-08-31,000001,Vente,83500,36,,AV DU MARECHAL LECLERC,0493,45270,45031,Bellegarde,45,,,45031000AB0118,,,,,,,,,,,,,0,4,Local industriel. commercial ou assimilé,200,0,S,sols,,,2017,2.451529,47.992548
2020-676204,2020-09-25,000001,Vente,90000,72,,RUE DEMERSAY,0300,45270,45031,Bellegarde,45,,,45031000AB0078,,,,,,,,,,,,,0,1,Maison,78,4,S,sols,,,363,2.444989,47.991966
2020-676204,2020-09-25,000001,Vente,90000,,,RUE DEMERSAY,0300,45270,45031,Bellegarde,45,,,45031000AB0298,,,,,,,,,,,,,0,,,,,AG,terrains d'agrément,,,329,2.445071,47.99185
2020-676249,2020-09-24,000001,Vente,122000,38,,AV DU MARECHAL LECLERC,0493,45270,45031,Bellegarde,45,,,45031000AB0157,,,,,,,,,,,,,0,1,Maison,72,5,J,jardins,,,1028,2.451871,47.992816
2020-676249,2020-09-24,000001,Vente,122000,,,PRAIRIE DE BELLEGARDE,B014,45270,45031,Bellegarde,45,,,45031000AH0171,,,,,,,,,,,,,0,,,,,J,jardins,,,88,2.452061,47.992595
2020-676467,2020-10-10,000001,Vente,109200,3,,ALL FLANDRES DUNKERQUE 1940,0313,45270,45031,Bellegarde,45,,,45031000AC0037,,,,,,,,,,,,,0,1,Maison,65,3,S,sols,,,260,2.440391,47.991036
