id_mutation,date_mutation,numero_disposition,nature_mutation,valeur_fonciere,adresse_numero,adresse_suffixe,adresse_nom_voie,adresse_code_voie,code_postal,code_commune,nom_commune,code_departement,ancien_code_commune,ancien_nom_commune,id_parcelle,ancien_id_parcelle,numero_volume,lot1_numero,lot1_surface_carrez,lot2_numero,lot2_surface_carrez,lot3_numero,lot3_surface_carrez,lot4_numero,lot4_surface_carrez,lot5_numero,lot5_surface_carrez,nombre_lots,code_type_local,type_local,surface_reelle_bati,nombre_pieces_principales,code_nature_culture,nature_culture,code_nature_culture_speciale,nature_culture_speciale,surface_terrain,longitude,latitude
2020-669292,2020-10-17,000001,Vente,33000,19,,GR GRANDE RUE,0011,45360,45251,Pierrefitte-ès-Bois,45,,,45251000AA0070,,,,,,,,,,,,,0,1,Maison,100,2,S,sols,,,81,2.71569,47.507608
2020-669292,2020-10-17,000001,Vente,33000,19,,GR GRANDE RUE,0011,45360,45251,Pierrefitte-ès-Bois,45,,,45251000AA0073,,,,,,,,,,,,,0,,,,,J,jardins,,,10,2.715442,47.507689
2020-669292,2020-10-17,000001,Vente,33000,,,LE BOURG,B048,45360,45251,Pierrefitte-ès-Bois,45,,,45251000AA0074,,,,,,,,,,,,,0,,,,,J,jardins,,,50,2.715416,47.507726
2020-669292,2020-10-17,000001,Vente,33000,,,LE BOURG,B048,45360,45251,Pierrefitte-ès-Bois,45,,,45251000AA0075,,,,,,,,,,,,,0,,,,,S,sols,,,4,2.715455,47.507727
2020-669491,2020-11-04,000001,Vente,12000,,,LES MICHAUX D EN BAS,B261,45360,45251,Pierrefitte-ès-Bois,45,,,452510000B0322,,,,,,,,,,,,,0,,,,,S,sols,,,44,2.721089,47.501363
2020-669491,2020-11-04,000001,Vente,12000,,,LES MICHAUX D EN BAS,B261,45360,45251,Pierrefitte-ès-Bois,45,,,452510000B0322,,,,,,,,,,,,,0,,,,,P,prés,,,20468,2.721089,47.501363
2020-669491,2020-11-04,000001,Vente,12000,5088,,LES MICHAUX D EN BAS,B261,45360,45251,Pierrefitte-ès-Bois,45,,,452510000B0386,,,,,,,,,,,,,0,1,Maison,52,1,S,sols,,,672,2.719511,47.501397
2020-670077,2020-11-26,000001,Vente,77000,33,,GR GRANDE RUE,0011,45360,45251,Pierrefitte-ès-Bois,45,,,45251000AA0113,,,,,,,,,,,,,0,1,Maison,175,5,S,sols,,,310,2.714871,47.506563
2020-670077,2020-11-26,000001,Vente,77000,,,LE BOURG,B048,45360,45251,Pierrefitte-ès-Bois,45,,,45251000AB0039,,,,,,,,,,,,,0,,,,,J,jardins,,,310,2.713053,47.50527
2020-670689,2020-12-10,000001,Vente,99000,5220,,TAILLE DE L ENFER,B370,45360,45251,Pierrefitte-ès-Bois,45,,,452510000A0943,,,,,,,,,,,,,0,1,Maison,90,4,AG,terrains d'agrément,,,2223,2.70025,47.516356
2020-670689,2020-12-10,000001,Vente,99000,5220,,TAILLE DE L ENFER,B370,45360,45251,Pierrefitte-ès-Bois,45,,,452510000A0943,,,,,,,,,,,,,0,1,Maison,90,4,S,sols,,,700,2.70025,47.516356
2020-672337,2020-12-05,000001,Vente,35000,2,,PL DU MONUMENT,0002,45360,45251,Pierrefitte-ès-Bois,45,,,45251000AA0118,,,,,,,,,,,,,0,1,Maison,61,2,S,sols,,,237,2.716062,47.507206
2020-677832,2020-02-05,000001,Vente,12000,5228,,LA PINARDERIE,B318,45360,45251,Pierrefitte-ès-Bois,45,,,452510000C0180,,,,,,,,,,,,,0,1,Maison,20,1,S,sols,,,751,2.695762,47.511177
2020-677832,2020-02-05,000001,Vente,12000,,,LA PINARDERIE,B318,45360,45251,Pierrefitte-ès-Bois,45,,,452510000C0183,,,,,,,,,,,,,0,,,,,T,terres,,,574,2.695434,47.511144
2020-677860,2020-01-11,000001,Vente,55000,5201,,LES ARDILLES,B005,45360,45251,Pierrefitte-ès-Bois,45,,,452510000A0907,,,,,,,,,,,,,0,1,Maison,76,3,S,sols,,,1458,2.704808,47.517439
2020-677860,2020-01-11,000001,Vente,55000,5201,,LES ARDILLES,B005,45360,45251,Pierrefitte-ès-Bois,45,,,452510000A0907,,,,,,,,,,,,,0,1,Maison,76,3,AG,terrains d'agrément,,,2931,2.704808,47.517439
2020-678041,2020-01-30,000001,Vente,410053,,,TAILLE DE LA MOUSSE,B371,45360,45251,Pierrefitte-ès-Bois,45,,,452510000A0249,,,,,,,,,,,,,0,,,,,T,terres,,,41044,2.700813,47.527342
2020-678041,2020-01-30,000001,Vente,410053,,,TAILLE DE LA MOUSSE,B371,45360,45251,Pierrefitte-ès-Bois,45,,,452510000A0251,,,,,,,,,,,,,0,,,,,P,prés,,,8469,2.701844,47.52568
2020-678041,2020-01-30,000001,Vente,410053,,,BRUYERES DU REAU,B056,45360,45251,Pierrefitte-ès-Bois,45,,,452510000A0267,,,,,,,,,,,,,0,,,,,T,terres,,,52334,2.702113,47.522541
2020-678041,2020-01-30,000001,Vente,410053,,,TERRE DU REAU,B381,45360,45251,Pierrefitte-ès-Bois,45,,,452510000A0269,,,,,,,,,,,,,0,,,,,T,terres,,,27203,2.703266,47.523888
2020-678041,2020-01-30,000001,Vente,410053,,,TERRE DU REAU,B381,45360,45251,Pierrefitte-ès-Bois,45,,,452510000A0270,,,,,,,,,,,,,0,,,,,T,terres,,,17845,2.704608,47.524498
2020-678041,2020-01-30,000001,Vente,410053,,,LE CHAMP DU FOSSE,B089,45360,45251,Pierrefitte-ès-Bois,45,,,452510000A0271,,,,,,,,,,,,,0,,,,,T,terres,,,16486,2.7062,47.525179
2020-678041,2020-01-30,000001,Vente,410053,,,CORBOIN,B136,45360,45251,Pierrefitte-ès-Bois,45,,,452510000A0278,,,,,,,,,,,,,0,,,,,T,terres,,,12296,2.708104,47.525222
2020-678041,2020-01-30,000001,Vente,410053,,,CORBOIN,B136,45360,45251,Pierrefitte-ès-Bois,45,,,452510000A0279,,,,,,,,,,,,,0,,,,,T,terres,,,4979,2.708003,47.525996
2020-678041,2020-01-30,000001,Vente,410053,,,CORBOIN,B136,45360,45251,Pierrefitte-ès-Bois,45,,,452510000A0280,,,,,,,,,,,,,0,,,,,T,terres,,,3170,2.708071,47.52674
2020-678041,2020-01-30,000001,Vente,410053,,,CORBOIN,B136,45360,45251,Pierrefitte-ès-Bois,45,,,452510000A0286,,,,,,,,,,,,,0,,,,,T,terres,,,3188,2.705747,47.52579
2020-678041,2020-01-30,000001,Vente,410053,,,LE LEVRIER,B233,45360,45251,Pierrefitte-ès-Bois,45,,,452510000A0289,,,,,,,,,,,,,0,,,,,T,terres,,,24152,2.706471,47.529105
2020-678041,2020-01-30,000001,Vente,410053,,,LES BRULIS,B051,45360,45251,Pierrefitte-ès-Bois,45,,,452510000A0291,,,,,,,,,,,,,0,,,,,T,terres,,,33111,2.708944,47.52973
2020-678041,2020-01-30,000001,Vente,410053,,,LES MOUSSELIERES,B266,45360,45251,Pierrefitte-ès-Bois,45,,,452510000A0295,,,,,,,,,,,,,0,,,,,T,terres,,,47120,2.710437,47.528314
2020-678041,2020-01-30,000001,Vente,410053,,,LA BOULASSE,B046,45360,45251,Pierrefitte-ès-Bois,45,,,452510000A0296,,,,,,,,,,,,,0,,,,,T,terres,,,21590,2.709566,47.526995
2020-678041,2020-01-30,000001,Vente,410053,,,LES BEURTHES,B014,45360,45251,Pierrefitte-ès-Bois,45,,,452510000A0297,,,,,,,,,,,,,0,,,,,T,terres,,,32933,2.710914,47.525772
2020-678041,2020-01-30,000001,Vente,410053,,,LES BEURTHES,B014,45360,45251,Pierrefitte-ès-Bois,45,,,452510000A0298,,,,,,,,,,,,,0,,,,,T,terres,,,36632,2.713104,47.525179
2020-678041,2020-01-30,000001,Vente,410053,,,LES BEURTHES,B014,45360,45251,Pierrefitte-ès-Bois,45,,,452510000A0299,,,,,,,,,,,,,0,,,,,T,terres,,,16603,2.714945,47.524656
2020-678041,2020-01-30,000001,Vente,410053,,,CHENEES DES POUSSETIERES,B120,45360,45251,Pierrefitte-ès-Bois,45,,,452510000A0572,,,,,,,,,,,,,0,,,,,T,terres,,,9315,2.716991,47.524934
2020-678041,2020-01-30,000001,Vente,410053,,,LES POUSSETIERES,B327,45360,45251,Pierrefitte-ès-Bois,45,,,452510000A0593,,,,,,,,,,,,,0,,,,,T,terres,,,28230,2.717568,47.523321
2020-678041,2020-01-30,000001,Vente,410053,,,LA GRAND PINIERE,B192,45360,45251,Pierrefitte-ès-Bois,45,,,452510000A0739,,,,,,,,,,,,,0,,,,,T,terres,,,56549,2.710597,47.523914
2020-678041,2020-01-30,000001,Vente,410053,,,CORBOIN,B136,45360,45251,Pierrefitte-ès-Bois,45,,,452510000A0887,,,,,,,,,,,,,0,,,,,J,jardins,,,959,2.706018,47.525548
2020-678041,2020-01-30,000001,Vente,410053,,,LA GARENNE,B168,45360,45251,Pierrefitte-ès-Bois,45,,,452510000A0984,,,,,,,,,,,,,0,,,,,T,terres,,,4344,2.708208,47.528116
2020-678041,2020-01-30,000001,Vente,410053,,,LES MOUSSELIERES,B266,45360,45251,Pierrefitte-ès-Bois,45,,,452510000A0986,,,,,,,,,,,,,0,,,,,T,terres,,,5656,2.711042,47.527739
2020-678041,2020-01-30,000001,Vente,410053,,,CORBOIN,B136,45360,45251,Pierrefitte-ès-Bois,45,,,452510000A1087,,,,,,,,,,,,,0,,,,,T,terres,,,670,2.707469,47.526471
2020-678041,2020-01-30,000001,Vente,410053,,,LE GRAND CHAMP,B183,45360,45251,Pierrefitte-ès-Bois,45,,,452510000A1092,,,,,,,,,,,,,0,,,,,T,terres,,,55078,2.705045,47.52617
2020-678041,2020-01-30,000001,Vente,410053,,,LA GARENNE,B168,45360,45251,Pierrefitte-ès-Bois,45,,,452510000A1094,,,,,,,,,,,,,0,,,,,T,terres,,,33824,2.707011,47.527428
2020-678041,2020-01-30,000001,Vente,410053,,,CORBOIN,B136,45360,45251,Pierrefitte-ès-Bois,45,,,452510000A1099,,,,,,,,,,,,,0,,,,,E,eaux,MARE,Mare,696,2.706486,47.52614
2020-678041,2020-01-30,000001,Vente,410053,5161,,CORBOIN,B136,45360,45251,Pierrefitte-ès-Bois,45,,,452510000A1101,,,,,,,,,,,,,0,1,Maison,90,4,S,sols,,,3648,2.706528,47.525977
2020-678046,2020-04-17,000001,Vente,72000,1,,RUE DE LA MAIRIE,0001,45360,45251,Pierrefitte-ès-Bois,45,,,45251000AA0026,,,,,,,,,,,,,0,1,Maison,100,4,S,sols,,,850,2.717021,47.507632
2020-678046,2020-04-17,000001,Vente,72000,,,LE BOURG,B048,45360,45251,Pierrefitte-ès-Bois,45,,,45251000AA0029,,,,,,,,,,,,,0,,,,,S,sols,,,8,2.716862,47.507699
2020-678046,2020-04-17,000001,Vente,72000,,,LE BOURG,B048,45360,45251,Pierrefitte-ès-Bois,45,,,45251000AA0136,,,,,,,,,,,,,0,,,,,S,sols,,,7,2.717113,47.507531
2020-678201,2020-05-29,000001,Vente,18000,,,GR GRANDE RUE,0011,45360,45251,Pierrefitte-ès-Bois,45,,,45251000AA0059,,,,,,,,,,,,,0,,,,,S,sols,,,103,2.716076,47.507955
2020-678201,2020-05-29,000001,Vente,18000,,,LE BOURG,B048,45360,45251,Pierrefitte-ès-Bois,45,,,45251000AA0061,,,,,,,,,,,,,0,,,,,S,sols,,,4,2.71602,47.507986
2020-678201,2020-05-29,000001,Vente,18000,,,LE BOURG,B048,45360,45251,Pierrefitte-ès-Bois,45,,,45251000AA0064,,,,,,,,,,,,,0,,,,,J,jardins,,,127,2.715967,47.507954
2020-678201,2020-05-29,000001,Vente,18000,,,LE BOURG,B048,45360,45251,Pierrefitte-ès-Bois,45,,,45251000AA0064,,,,,,,,,,,,,0,,,,,S,sols,,,17,2.715967,47.507954
2020-678201,2020-05-29,000001,Vente,18000,9,,GR GRANDE RUE,0011,45360,45251,Pierrefitte-ès-Bois,45,,,45251000AA0065,,,,,,,,,,,,,0,1,Maison,65,4,S,sols,,,70,2.716117,47.507877
2020-678227,2020-06-02,000001,Vente,100000,6,,IMP DU MOULIN,0014,45360,45251,Pierrefitte-ès-Bois,45,,,45251000AA0100,,,,,,,,,,,,,0,1,Maison,85,4,S,sols,,,131,2.714336,47.507617
2020-678227,2020-06-02,000001,Vente,100000,,,LE BOURG,B048,45360,45251,Pierrefitte-ès-Bois,45,,,45251000AA0101,,,,,,,,,,,,,0,,,,,E,eaux,ETANG,Etangs,44,2.714097,47.50762
2020-678227,2020-06-02,000001,Vente,100000,8,,IMP DU MOULIN,0014,45360,45251,Pierrefitte-ès-Bois,45,,,45251000AA0102,,,,,,,,,,,,,0,3,Dépendance,,0,J,jardins,,,820,2.714002,47.507572
2020-678227,2020-06-02,000001,Vente,100000,8,,IMP DU MOULIN,0014,45360,45251,Pierrefitte-ès-Bois,45,,,45251000AA0102,,,,,,,,,,,,,0,3,Dépendance,,0,S,sols,,,246,2.714002,47.507572
2020-678227,2020-06-02,000001,Vente,100000,8,,IMP DU MOULIN,0014,45360,45251,Pierrefitte-ès-Bois,45,,,45251000AA0102,,,,,,,,,,,,,0,1,Maison,70,3,S,sols,,,246,2.714002,47.507572
2020-678227,2020-06-02,000001,Vente,100000,8,,IMP DU MOULIN,0014,45360,45251,Pierrefitte-ès-Bois,45,,,45251000AA0102,,,,,,,,,,,,,0,1,Maison,70,3,J,jardins,,,820,2.714002,47.507572
2020-678227,2020-06-02,000001,Vente,100000,,,IMP DU MOULIN,0014,45360,45251,Pierrefitte-ès-Bois,45,,,45251000AA0103,,,,,,,,,,,,,0,,,,,S,sols,,,473,2.714216,47.507492
2020-678227,2020-06-02,000001,Vente,100000,10,,IMP DU MOULIN,0014,45360,45251,Pierrefitte-ès-Bois,45,,,45251000AA0104,,,,,,,,,,,,,0,3,Dépendance,,0,S,sols,,,256,2.713933,47.507365
2020-678227,2020-06-02,000001,Vente,100000,5065,,RUE DU MOULIN,0004,45360,45251,Pierrefitte-ès-Bois,45,,,45251000AA0105,,,,,,,,,,,,,0,1,Maison,40,1,S,sols,,,350,2.714148,47.507334
2020-678227,2020-06-02,000001,Vente,100000,,,LE BOURG,B048,45360,45251,Pierrefitte-ès-Bois,45,,,45251000AA0108,,,,,,,,,,,,,0,,,,,E,eaux,ETANG,Etangs,97,2.714494,47.507203
2020-678227,2020-06-02,000001,Vente,100000,,,LE BOURG,B048,45360,45251,Pierrefitte-ès-Bois,45,,,45251000AA0111,,,,,,,,,,,,,0,,,,,E,eaux,ETANG,Etangs,46,2.715155,47.506773
2020-678227,2020-06-02,000001,Vente,100000,,,IMP DU MOULIN,0014,45360,45251,Pierrefitte-ès-Bois,45,,,45251000AA0139,,,,,,,,,,,,,0,,,,,S,sols,,,4,2.714363,47.507492
2020-678227,2020-06-02,000001,Vente,100000,,,LE BOURG,B048,45360,45251,Pierrefitte-ès-Bois,45,,,45251000AA0140,,,,,,,,,,,,,0,,,,,E,eaux,ETANG,Etangs,69,2.714328,47.507422
2020-678320,2020-07-08,000001,Vente,115000,,,LA PETITE BORDE,B298,45360,45251,Pierrefitte-ès-Bois,45,,,452510000B0533,,,,,,,,,,,,,0,,,,,P,prés,,,9378,2.683166,47.483688
2020-678320,2020-07-08,000001,Vente,115000,,,LA PETITE BORDE,B298,45360,45251,Pierrefitte-ès-Bois,45,,,452510000B0538,,,,,,,,,,,,,0,,,,,P,prés,,,6041,2.68172,47.484064
2020-678320,2020-07-08,000001,Vente,115000,,,LES VERDATS,B396,45360,45251,Pierrefitte-ès-Bois,45,,,452510000B0543,,,,,,,,,,,,,0,,,,,T,terres,,,353,2.68022,47.484103
2020-678320,2020-07-08,000001,Vente,115000,,,LES VERDATS,B396,45360,45251,Pierrefitte-ès-Bois,45,,,452510000B0907,,,,,,,,,,,,,0,,,,,P,prés,,,419,2.681091,47.483754
2020-678320,2020-07-08,000001,Vente,115000,,,LES VERDATS,B396,45360,45251,Pierrefitte-ès-Bois,45,,,452510000B1100,,,,,,,,,,,,,0,,,,,T,terres,,,2308,2.680672,47.48403
2020-678320,2020-07-08,000001,Vente,115000,5103,,LES VERDATS,B396,45360,45251,Pierrefitte-ès-Bois,45,,,452510000B1102,,,,,,,,,,,,,0,1,Maison,60,3,S,sols,,,1545,2.681235,47.483956
2020-678320,2020-07-08,000001,Vente,115000,5255,,LES VERDATS,B396,45360,45251,Pierrefitte-ès-Bois,45,,,452510000B1103,,,,,,,,,,,,,0,3,Dépendance,,0,S,sols,,,45,2.680868,47.483928
2020-678381,2020-06-23,000001,Vente,38000,4,,PL DU MONUMENT,0002,45360,45251,Pierrefitte-ès-Bois,45,,,45251000AA0125,,,,,,,,,,,,,0,1,Maison,52,3,S,sols,,,363,2.71603,47.507323
2020-678607,2020-09-30,000001,Vente,45600,,,CHAMP DU GUE,B090,45360,45251,Pierrefitte-ès-Bois,45,,,452510000A0598,,,,,,,,,,,,,0,,,,,T,terres,,,13595,2.717033,47.519193
2020-678607,2020-09-30,000001,Vente,45600,,,CHAMP DU GUE,B090,45360,45251,Pierrefitte-ès-Bois,45,,,452510000A0600,,,,,,,,,,,,,0,,,,,T,terres,,,1039,2.714809,47.518809
2020-678607,2020-09-30,000001,Vente,45600,,,LA MARNE DES NAUDETS,B247,45360,45251,Pierrefitte-ès-Bois,45,,,452510000B0030,,,,,,,,,,,,,0,,,,,T,terres,,,14249,2.703056,47.510496
2020-678607,2020-09-30,000001,Vente,45600,,,BUISSON SERIN,B057,45360,45251,Pierrefitte-ès-Bois,45,,,452510000B0043,,,,,,,,,,,,,0,,,,,P,prés,,,1360,2.698377,47.508467
2020-678607,2020-09-30,000001,Vente,45600,,,BUISSON SERIN,B057,45360,45251,Pierrefitte-ès-Bois,45,,,452510000B0044,,,,,,,,,,,,,0,,,,,P,prés,,,3862,2.698473,47.507706
2020-678607,2020-09-30,000001,Vente,45600,,,BUISSON SERIN,B057,45360,45251,Pierrefitte-ès-Bois,45,,,452510000B0045,,,,,,,,,,,,,0,,,,,P,prés,,,7484,2.698157,47.506697
2020-678607,2020-09-30,000001,Vente,45600,,,LA BOULAIE,B044,45360,45251,Pierrefitte-ès-Bois,45,,,452510000C0167,,,,,,,,,,,,,0,,,,,T,terres,,,12560,2.696644,47.513116
2020-678607,2020-09-30,000001,Vente,45600,,,LA BOULAIE,B044,45360,45251,Pierrefitte-ès-Bois,45,,,452510000C0169,,,,,,,,,,,,,0,,,,,T,terres,,,13096,2.696355,47.511938
2020-678607,2020-09-30,000001,Vente,45600,,,PRE DES NONETTES,B338,45360,45251,Pierrefitte-ès-Bois,45,,,452510000C0172,,,,,,,,,,,,,0,,,,,P,prés,,,4872,2.697519,47.50897
2020-678607,2020-09-30,000001,Vente,45600,,,LE MOUSTA,B267,45360,45251,Pierrefitte-ès-Bois,45,,,452510000C0176,,,,,,,,,,,,,0,,,,,T,terres,,,10695,2.696813,47.510141
2020-678607,2020-09-30,000001,Vente,45600,,,LA PINARDERIE,B318,45360,45251,Pierrefitte-ès-Bois,45,,,452510000C0182,,,,,,,,,,,,,0,,,,,P,prés,,,3300,2.695395,47.511464
2020-678607,2020-09-30,000001,Vente,45600,,,PRE DE MANCHE,B334,45360,45251,Pierrefitte-ès-Bois,45,,,452510000C0187,,,,,,,,,,,,,0,,,,,P,prés,,,1833,2.693118,47.509912
2020-678607,2020-09-30,000001,Vente,45600,,,LA PINARDERIE,B318,45360,45251,Pierrefitte-ès-Bois,45,,,452510000C0188,,,,,,,,,,,,,0,,,,,T,terres,,,7917,2.693339,47.510363
2020-678607,2020-09-30,000001,Vente,45600,,,LA PINARDERIE,B318,45360,45251,Pierrefitte-ès-Bois,45,,,452510000C0189,,,,,,,,,,,,,0,,,,,T,terres,,,6527,2.694185,47.511379
2020-678607,2020-09-30,000001,Vente,45600,,,LA PINARDERIE,B318,45360,45251,Pierrefitte-ès-Bois,45,,,452510000C0190,,,,,,,,,,,,,0,,,,,T,terres,,,3129,2.695233,47.511954
2020-678607,2020-09-30,000001,Vente,45600,,,LA PINARDERIE,B318,45360,45251,Pierrefitte-ès-Bois,45,,,452510000C0191,,,,,,,,,,,,,0,,,,,T,terres,,,1964,2.694953,47.512015
2020-678607,2020-09-30,000001,Vente,45600,,,LE CHAILLOU AU PAGE,B068,45360,45251,Pierrefitte-ès-Bois,45,,,452510000C0193,,,,,,,,,,,,,0,,,,,T,terres,,,6064,2.693193,47.511067
2020-678607,2020-09-30,000001,Vente,45600,,,LE CHAILLOU AU PAGE,B068,45360,45251,Pierrefitte-ès-Bois,45,,,452510000C0194,,,,,,,,,,,,,0,,,,,P,prés,,,2432,2.692281,47.510847
2020-678717,2020-10-17,000001,Vente,103650,27,,GR GRANDE RUE,0011,45360,45251,Pierrefitte-ès-Bois,45,,,45251000AA0087,,,,,,,,,,,,,0,1,Maison,131,6,S,sols,,,376,2.715369,47.507351
2020-678717,2020-10-17,000001,Vente,103650,,,RUE DE SURY,0012,45360,45251,Pierrefitte-ès-Bois,45,,,45251000AB0031,,,,,,,,,,,,,0,,,,,S,sols,,,170,2.713646,47.504936
2020-678717,2020-10-17,000001,Vente,103650,,,LE BOURG,B048,45360,45251,Pierrefitte-ès-Bois,45,,,45251000AB0035,,,,,,,,,,,,,0,,,,,J,jardins,,,324,2.713305,47.505059
2020-678717,2020-10-17,000001,Vente,103650,,,LE BOURG,B048,45360,45251,Pierrefitte-ès-Bois,45,,,45251000AB0036,,,,,,,,,,,,,0,,,,,J,jardins,,,261,2.713283,47.504905
2020-678717,2020-10-17,000001,Vente,103650,,,LE BOURG,B048,45360,45251,Pierrefitte-ès-Bois,45,,,45251000AB0037,,,,,,,,,,,,,0,,,,,J,jardins,,,249,2.713162,47.505226
