id_mutation,date_mutation,numero_disposition,nature_mutation,valeur_fonciere,adresse_numero,adresse_suffixe,adresse_nom_voie,adresse_code_voie,code_postal,code_commune,nom_commune,code_departement,ancien_code_commune,ancien_nom_commune,id_parcelle,ancien_id_parcelle,numero_volume,lot1_numero,lot1_surface_carrez,lot2_numero,lot2_surface_carrez,lot3_numero,lot3_surface_carrez,lot4_numero,lot4_surface_carrez,lot5_numero,lot5_surface_carrez,nombre_lots,code_type_local,type_local,surface_reelle_bati,nombre_pieces_principales,code_nature_culture,nature_culture,code_nature_culture_speciale,nature_culture_speciale,surface_terrain,longitude,latitude
2020-678925,2020-01-14,000001,Vente,2300,,,SUL PECH,B081,46160,46049,Calvignac,46,,,46049000AC0093,,,,,,,,,,,,,0,,,,,BT,taillis simples,,,445,1.779138,44.467309
2020-678925,2020-01-14,000001,Vente,2300,,,SUL PECH,B081,46160,46049,Calvignac,46,,,46049000AC0096,,,,,,,,,,,,,0,,,,,BT,taillis simples,,,140,1.779042,44.467141
2020-679105,2020-01-31,000001,Vente,270000,,,CALVIGNAC,B011,46160,46049,Calvignac,46,,,46049000AC0171,,,,,,,,,,,,,0,,,,,J,jardins,POTAG,Jardin potager,630,1.778989,44.465089
2020-679105,2020-01-31,000001,Vente,270000,,,CALVIGNAC,B011,46160,46049,Calvignac,46,,,46049000AC0173,,,,,,,,,,,,,0,,,,,J,jardins,POTAG,Jardin potager,150,1.778772,44.464904
2020-679105,2020-01-31,000001,Vente,270000,,,CALVIGNAC,B011,46160,46049,Calvignac,46,,,46049000AC0174,,,,,,,,,,,,,0,,,,,S,sols,,,315,1.779032,44.464956
2020-679105,2020-01-31,000001,Vente,270000,32,,CALVIGNAC,B011,46160,46049,Calvignac,46,,,46049000AC0175,,,,,,,,,,,,,0,1,Maison,175,7,S,sols,,,190,1.778948,44.464849
2020-679105,2020-01-31,000001,Vente,270000,,,CALVIGNAC,B011,46160,46049,Calvignac,46,,,46049000AC0495,,,,,,,,,,,,,0,,,,,L,landes,PACAG,Pacage,50,1.779111,44.465243
2020-679105,2020-01-31,000001,Vente,270000,,,SUL PECH,B081,46160,46049,Calvignac,46,,,46049000AC0498,,,,,,,,,,,,,0,,,,,L,landes,,,510,1.779336,44.465004
2020-679294,2020-02-01,000002,Echange,500,,,LA RIVE,B073,46160,46049,Calvignac,46,,,46049000AB0021,,,,,,,,,,,,,0,,,,,T,terres,,,379,1.760109,44.458086
2020-679294,2020-02-01,000002,Echange,500,,,LA RIVE,B073,46160,46049,Calvignac,46,,,46049000AB0021,,,,,,,,,,,,,0,,,,,T,terres,,,379,1.760109,44.458086
2020-679294,2020-02-01,000002,Echange,500,,,LA RIVE,B073,46160,46049,Calvignac,46,,,46049000AB0022,,,,,,,,,,,,,0,,,,,T,terres,,,3416,1.761241,44.459404
2020-679425,2020-02-13,000001,Vente,12171,,,LA CARRIERE,B016,46160,46049,Calvignac,46,,,46049000AB0140,,,,,,,,,,,,,0,,,,,T,terres,,,4710,1.769616,44.45805
2020-679425,2020-02-13,000001,Vente,12171,,,LA CARRIERE,B016,46160,46049,Calvignac,46,,,46049000AB0140,,,,,,,,,,,,,0,,,,,T,terres,,,2355,1.769616,44.45805
2020-679425,2020-02-13,000001,Vente,12171,,,CAMP DEL TREIL,B013,46160,46049,Calvignac,46,,,46049000AB0393,,,,,,,,,,,,,0,,,,,T,terres,,,88,1.764141,44.459159
2020-679425,2020-02-13,000001,Vente,12171,,,CAMP DEL TREIL,B013,46160,46049,Calvignac,46,,,46049000AB0394,,,,,,,,,,,,,0,,,,,T,terres,,,9125,1.764815,44.458858
2020-679425,2020-02-13,000001,Vente,12171,,,CAMP DEL TREIL,B013,46160,46049,Calvignac,46,,,46049000AB0394,,,,,,,,,,,,,0,,,,,S,sols,,,702,1.764815,44.458858
2020-679533,2020-03-12,000001,Vente,50000,,,SUL PECH,B081,46160,46049,Calvignac,46,,,46049000AC0087,,,,,,,,,,,,,0,,,,,T,terres,,,650,1.775937,44.467818
2020-679533,2020-03-12,000001,Vente,50000,68,,CALVIGNAC,B011,46160,46049,Calvignac,46,,,46049000AC0222,,,,,,,,,,,,,0,1,Maison,116,4,S,sols,,,47,1.779027,44.463736
2020-679533,2020-03-12,000001,Vente,50000,,,CALVIGNAC,B011,46160,46049,Calvignac,46,,,46049000AC0224,,,,,,,,,,,,,0,,,,,S,sols,,,22,1.779117,44.463685
2020-679533,2020-03-12,000001,Vente,50000,,,CALVIGNAC,B011,46160,46049,Calvignac,46,,,46049000AC0514,,,,,,,,,,,,,0,,,,,S,sols,,,22,1.779079,44.463699
2020-679686,2020-03-10,000001,Vente,3500,,,CAMP DEL TREIL,B013,46160,46049,Calvignac,46,,,46049000AB0376,,,,,,,,,,,,,0,,,,,T,terres,,,830,1.763878,44.458909
2020-679686,2020-03-10,000001,Vente,3500,,,CAMP DEL TREIL,B013,46160,46049,Calvignac,46,,,46049000AB0392,,,,,,,,,,,,,0,,,,,T,terres,,,2987,1.763805,44.459191
2020-679686,2020-03-10,000001,Vente,3500,,,CAMP DEL TREIL,B013,46160,46049,Calvignac,46,,,46049000AB0395,,,,,,,,,,,,,0,,,,,T,terres,,,88,1.764024,44.458885
2020-680834,2020-06-23,000001,Vente,34000,,,ROC DE GUIROL,B075,46160,46049,Calvignac,46,,,46049000AD0393,,,,,,,,,,,,,0,,,,,BR,futaies résineuses,PIN,Pins,5020,1.780844,44.458968
2020-681732,2020-08-28,000001,Vente,40000,5135,,AURIOL,B004,46160,46049,Calvignac,46,,,46049000AK0001,,,,,,,,,,,,,0,4,Local industriel. commercial ou assimilé,,,BT,taillis simples,,,15520,1.811426,44.466327
2020-681732,2020-08-28,000001,Vente,40000,5135,,AURIOL,B004,46160,46049,Calvignac,46,,,46049000AK0001,,,,,,,,,,,,,0,4,Local industriel. commercial ou assimilé,,,BT,taillis simples,,,15520,1.811426,44.466327
2020-681732,2020-08-28,000001,Vente,40000,,,PECH PECHAURE,B062,46160,46049,Calvignac,46,,,46049000AK0028,,,,,,,,,,,,,0,,,,,BT,taillis simples,,,146945,1.809072,44.460196
2020-681808,2020-09-02,000001,Vente,1860,,,CAMP SABATIER,B015,46160,46049,Calvignac,46,,,46049000AC0303,,,,,,,,,,,,,0,,,,,T,terres,,,1860,1.771599,44.46145
2020-682885,2020-11-06,000001,Vente,578000,,,COMBE CAVE,B023,46160,46049,Calvignac,46,,,46049000AT0060,,,,,,,,,,,,,0,,,,,BT,taillis simples,,,2220,1.772868,44.449431
2020-682885,2020-11-06,000001,Vente,578000,,,COMBE CAVE,B023,46160,46049,Calvignac,46,,,46049000AT0061,,,,,,,,,,,,,0,,,,,T,terres,,,7715,1.773307,44.449519
2020-682885,2020-11-06,000001,Vente,578000,,,COMBE CAVE,B023,46160,46049,Calvignac,46,,,46049000AT0064,,,,,,,,,,,,,0,,,,,T,terres,,,2465,1.774302,44.450032
2020-682885,2020-11-06,000001,Vente,578000,,,COMBE CAVE,B023,46160,46049,Calvignac,46,,,46049000AT0065,,,,,,,,,,,,,0,,,,,L,landes,PACAG,Pacage,2805,1.774333,44.450478
2020-682885,2020-11-06,000001,Vente,578000,5066,F,COMBE CAVE,B023,46160,46049,Calvignac,46,,,46049000AT0066,,,,,,,,,,,,,0,1,Maison,220,6,S,sols,,,3545,1.773458,44.450924
2020-682885,2020-11-06,000001,Vente,578000,,,COMBE CAVE,B023,46160,46049,Calvignac,46,,,46049000AT0067,,,,,,,,,,,,,0,,,,,BT,taillis simples,,,2206,1.773601,44.450356
2020-682885,2020-11-06,000001,Vente,578000,,,COMBE CAVE,B023,46160,46049,Calvignac,46,,,46049000AT0067,,,,,,,,,,,,,0,,,,,S,sols,,,100,1.773601,44.450356
2020-682885,2020-11-06,000001,Vente,578000,,,COMBE CAVE,B023,46160,46049,Calvignac,46,,,46049000AT0067,,,,,,,,,,,,,0,,,,,L,landes,PACAG,Pacage,5983,1.773601,44.450356
2020-682885,2020-11-06,000001,Vente,578000,,,COMBE CAVE,B023,46160,46049,Calvignac,46,,,46049000AT0067,,,,,,,,,,,,,0,,,,,BT,taillis simples,,,5506,1.773601,44.450356
2020-682885,2020-11-06,000001,Vente,578000,,,COMBE CAVE,B023,46160,46049,Calvignac,46,,,46049000AT0068,,,,,,,,,,,,,0,,,,,BT,taillis simples,,,2142,1.772913,44.450094
2020-683084,2020-11-20,000001,Vente,130000,10,A,LE COMMUNAL,B026,46160,46049,Calvignac,46,,,46049000AC0324,,,,,,,,,,,,,0,1,Maison,108,5,S,sols,,,576,1.77263,44.463756
2020-683084,2020-11-20,000001,Vente,130000,,,LE COMMUNAL,B026,46160,46049,Calvignac,46,,,46049000AC0325,,,,,,,,,,,,,0,,,,,S,sols,,,1405,1.772134,44.464032
2020-683084,2020-11-20,000001,Vente,130000,,,LE COMMUNAL,B026,46160,46049,Calvignac,46,,,46049000AC0330,,,,,,,,,,,,,0,,,,,T,terres,,,3559,1.772606,44.464151
2020-683084,2020-11-20,000001,Vente,130000,,,LE COMMUNAL,B026,46160,46049,Calvignac,46,,,46049000AC0487,,,,,,,,,,,,,0,,,,,T,terres,,,114,1.772817,44.463684
2020-683225,2020-12-02,000001,Vente,2600,,,ANDREVES,B002,46160,46049,Calvignac,46,,,46049000AS0022,,,,,,,,,,,,,0,,,,,BT,taillis simples,,,19730,1.772687,44.44476
2020-683225,2020-12-02,000001,Vente,2600,,,ANDREVES,B002,46160,46049,Calvignac,46,,,46049000AS0023,,,,,,,,,,,,,0,,,,,BT,taillis simples,,,2985,1.773872,44.445073
2020-683225,2020-12-02,000001,Vente,2600,,,ANDREVES,B002,46160,46049,Calvignac,46,,,46049000AS0030,,,,,,,,,,,,,0,,,,,BT,taillis simples,,,9655,1.774396,44.443793
2020-683225,2020-12-02,000001,Vente,2600,,,COMBE CAVE,B023,46160,46049,Calvignac,46,,,46049000AT0053,,,,,,,,,,,,,0,,,,,L,landes,,,2640,1.773424,44.446209
2020-683225,2020-12-02,000001,Vente,2600,,,COMBE CAVE,B023,46160,46049,Calvignac,46,,,46049000AT0126,,,,,,,,,,,,,0,,,,,L,landes,,,2305,1.772414,44.447226
