id_mutation,date_mutation,numero_disposition,nature_mutation,valeur_fonciere,adresse_numero,adresse_suffixe,adresse_nom_voie,adresse_code_voie,code_postal,code_commune,nom_commune,code_departement,ancien_code_commune,ancien_nom_commune,id_parcelle,ancien_id_parcelle,numero_volume,lot1_numero,lot1_surface_carrez,lot2_numero,lot2_surface_carrez,lot3_numero,lot3_surface_carrez,lot4_numero,lot4_surface_carrez,lot5_numero,lot5_surface_carrez,nombre_lots,code_type_local,type_local,surface_reelle_bati,nombre_pieces_principales,code_nature_culture,nature_culture,code_nature_culture_speciale,nature_culture_speciale,surface_terrain,longitude,latitude
2020-679605,2020-02-28,000001,Vente,183950,5179,,LA NOUGAYREDE,B065,46350,46186,Masclat,46,,,461860000A0455,,,,,,,,,,,,,0,1,Maison,85,3,S,sols,,,850,1.385474,44.842781
2020-679605,2020-02-28,000001,Vente,183950,,,LA NOUGAYREDE,B065,46350,46186,Masclat,46,,,461860000A1017,,,,,,,,,,,,,0,,,,,T,terres,,,227,1.385315,44.843104
2020-679605,2020-02-28,000001,Vente,183950,,,LA NOUGAYREDE,B065,46350,46186,Masclat,46,,,461860000A1020,,,,,,,,,,,,,0,,,,,T,terres,,,3323,1.385699,44.842854
2020-679605,2020-02-28,000001,Vente,183950,,,LA NOUGAYREDE,B065,46350,46186,Masclat,46,,,461860000A1027,,,,,,,,,,,,,0,,,,,BT,taillis simples,,,16,1.385813,44.842482
2020-679605,2020-02-28,000001,Vente,183950,,,LA NOUGAYREDE,B065,46350,46186,Masclat,46,,,461860000A1029,,,,,,,,,,,,,0,,,,,BT,taillis simples,,,344,1.385349,44.84271
2020-679885,2020-04-09,000001,Vente,27000,,,LE BOURG,B007,46350,46186,Masclat,46,,,461860000A0719,,,,,,,,,,,,,0,,,,,T,terres,,,942,1.390815,44.835515
2020-679885,2020-04-09,000001,Vente,27000,,,LE BOURG,B007,46350,46186,Masclat,46,,,461860000A0720,,,,,,,,,,,,,0,,,,,S,sols,,,364,1.390648,44.835252
2020-679956,2020-04-27,000001,Vente,150000,5104,,FONTVIEILLE,B040,46350,46186,Masclat,46,,,461860000A0825,,,,,,,,,,,,,0,1,Maison,80,4,S,sols,,,740,1.384487,44.836293
2020-680460,2020-06-18,000001,Vente,2000,,,AU BALLAT,B002,46350,46186,Masclat,46,,,461860000B0490,,,,,,,,,,,,,0,,,,,T,terres,,,6380,1.380548,44.828873
2020-680460,2020-06-18,000001,Vente,2000,,,COMBE DE L ESTANG,B022,46350,46186,Masclat,46,,,461860000B0527,,,,,,,,,,,,,0,,,,,T,terres,,,3246,1.381117,44.820839
2020-680460,2020-06-18,000001,Vente,2000,,,LAVIZADE,B051,46350,46186,Masclat,46,,,461860000C0197,,,,,,,,,,,,,0,,,,,B,bois,CHAT,Châtaigneraie,4480,1.380354,44.827156
2020-680460,2020-06-18,000001,Vente,2000,,,LAVIZADE,B051,46350,46186,Masclat,46,,,461860000C0207,,,,,,,,,,,,,0,,,,,S,sols,,,4836,1.376966,44.827592
2020-680460,2020-06-18,000001,Vente,2000,,,LAVIZADE,B051,46350,46186,Masclat,46,,,461860000C0207,,,,,,,,,,,,,0,,,,,BT,taillis simples,,,856,1.376966,44.827592
2020-680807,2020-06-25,000001,Vente,2000,,,MALPERDU,B055,46350,46186,Masclat,46,,,461860000A0093,,,,,,,,,,,,,0,,,,,BT,taillis simples,,,3888,1.394577,44.84773
2020-680807,2020-06-25,000001,Vente,2000,,,LE SERRE,B080,46350,46186,Masclat,46,,,461860000A0249,,,,,,,,,,,,,0,,,,,BT,taillis simples,,,290,1.401581,44.844244
2020-680807,2020-06-25,000001,Vente,2000,,,LA GARENNE,B042,46350,46186,Masclat,46,,,461860000A0290,,,,,,,,,,,,,0,,,,,BT,taillis simples,,,800,1.399523,44.840429
2020-680807,2020-06-25,000001,Vente,2000,,,LA GARENNE,B042,46350,46186,Masclat,46,,,461860000A0292,,,,,,,,,,,,,0,,,,,BT,taillis simples,,,1735,1.400103,44.840784
2020-680807,2020-06-25,000001,Vente,2000,,,LE MOULINOU,B062,46350,46186,Masclat,46,,,461860000A0658,,,,,,,,,,,,,0,,,,,T,terres,,,3330,1.401313,44.834817
2020-680807,2020-06-25,000001,Vente,2000,,,LE MOULINOU,B062,46350,46186,Masclat,46,,,461860000A0659,,,,,,,,,,,,,0,,,,,P,prés,,,815,1.401116,44.834237
2020-680807,2020-06-25,000001,Vente,2000,,,LE MOULINOU,B062,46350,46186,Masclat,46,,,461860000A0659,,,,,,,,,,,,,0,,,,,P,prés,,,815,1.401116,44.834237
2020-680807,2020-06-25,000001,Vente,2000,,,PECH DE BIAR,B068,46350,46186,Masclat,46,,,461860000B0232,,,,,,,,,,,,,0,,,,,B,bois,CHAT,Châtaigneraie,2630,1.393381,44.828953
2020-680807,2020-06-25,000001,Vente,2000,,,AU BALLAT,B002,46350,46186,Masclat,46,,,461860000B0484,,,,,,,,,,,,,0,,,,,B,bois,CHAT,Châtaigneraie,2108,1.382068,44.828241
2020-680807,2020-06-25,000001,Vente,2000,,,AU BALLAT,B002,46350,46186,Masclat,46,,,461860000B0485,,,,,,,,,,,,,0,,,,,B,bois,CHAT,Châtaigneraie,1866,1.382148,44.828607
2020-680807,2020-06-25,000001,Vente,2000,,,LAVIZADE,B051,46350,46186,Masclat,46,,,461860000C0154,,,,,,,,,,,,,0,,,,,BR,futaies résineuses,,,2646,1.376487,44.829318
2020-680807,2020-06-25,000001,Vente,2000,,,LAVIZADE,B051,46350,46186,Masclat,46,,,461860000C0179,,,,,,,,,,,,,0,,,,,BT,taillis simples,,,1380,1.376601,44.828962
2020-680807,2020-06-25,000001,Vente,2000,,,LACHAMP,B045,46350,46186,Masclat,46,,,461860000C0383,,,,,,,,,,,,,0,,,,,BS,taillis sous futaie,,,2976,1.366831,44.824479
2020-680807,2020-06-25,000001,Vente,2000,,,LACHAMP,B045,46350,46186,Masclat,46,,,461860000C0385,,,,,,,,,,,,,0,,,,,BT,taillis simples,,,2780,1.367114,44.825043
2020-681042,2020-07-08,000001,Vente,151050,260,,RTE DU GREZAILLOU,0046,46350,46186,Masclat,46,,,461860000B0102,,,,,,,,,,,,,0,1,Maison,113,5,S,sols,,,323,1.392164,44.831709
2020-681042,2020-07-08,000001,Vente,151050,260,,RTE DU GREZAILLOU,0046,46350,46186,Masclat,46,,,461860000B0102,,,,,,,,,,,,,0,3,Dépendance,,0,S,sols,,,323,1.392164,44.831709
2020-681042,2020-07-08,000001,Vente,151050,260,,RTE DU GREZAILLOU,0046,46350,46186,Masclat,46,,,461860000B0102,,,,,,,,,,,,,0,3,Dépendance,,0,S,sols,,,323,1.392164,44.831709
2020-681042,2020-07-08,000001,Vente,151050,,,LES GREZALS,B044,46350,46186,Masclat,46,,,461860000B0103,,,,,,,,,,,,,0,,,,,T,terres,,,980,1.392052,44.83163
2020-681777,2020-09-07,000001,Vente,1100,,,DEBATS,B032,46350,46186,Masclat,46,,,461860000C0681,,,,,,,,,,,,,0,,,,,BS,taillis sous futaie,,,4428,1.367801,44.816089
2020-682152,2020-10-07,000001,Vente,166500,5133,,LE BOURG,B007,46350,46186,Masclat,46,,,461860000A0715,,,,,,,,,,,,,0,1,Maison,94,3,S,sols,,,603,1.390523,44.836057
2020-682152,2020-10-07,000001,Vente,166500,,,LE BOURG,B007,46350,46186,Masclat,46,,,461860000A0716,,,,,,,,,,,,,0,,,,,S,sols,,,528,1.390436,44.835961
2020-682152,2020-10-07,000001,Vente,166500,,,LE BOURG,B007,46350,46186,Masclat,46,,,461860000A0717,,,,,,,,,,,,,0,,,,,T,terres,,,1185,1.390784,44.835837
2020-683333,2020-12-14,000001,Vente,73000,84,,RTE DES GREZALS,0042,46350,46186,Masclat,46,,,461860000B0043,,,,,,,,,,,,,0,1,Maison,94,4,S,sols,,,450,1.389857,44.832261
2020-683333,2020-12-14,000001,Vente,73000,84,,RTE DES GREZALS,0042,46350,46186,Masclat,46,,,461860000B0043,,,,,,,,,,,,,0,3,Dépendance,,0,S,sols,,,450,1.389857,44.832261
2020-683333,2020-12-14,000001,Vente,73000,,,PECH DE BIAR,B068,46350,46186,Masclat,46,,,461860000B0230,,,,,,,,,,,,,0,,,,,B,bois,CHAT,Châtaigneraie,3000,1.394597,44.828821
2020-683333,2020-12-14,000001,Vente,73000,,,PECH DE BIAR,B068,46350,46186,Masclat,46,,,461860000B0254,,,,,,,,,,,,,0,,,,,B,bois,CHAT,Châtaigneraie,2743,1.390117,44.826858
2020-683333,2020-12-14,000001,Vente,73000,,,LES GREZALS,B044,46350,46186,Masclat,46,,,461860000B0657,,,,,,,,,,,,,0,,,,,T,terres,,,3350,1.389693,44.832399
2020-683333,2020-12-14,000001,Vente,73000,,,CHAMPONNES,B016,46350,46186,Masclat,46,,,461860000C0219,,,,,,,,,,,,,0,,,,,BT,taillis simples,,,7704,1.37607,44.825271
2020-683479,2020-12-03,000001,Vente,1500,,,LACHAMP,B045,46350,46186,Masclat,46,,,461860000C0397,,,,,,,,,,,,,0,,,,,T,terres,,,5928,,
2020-683688,2020-12-28,000001,Vente,65000,5053,,LE BOURG,B007,46350,46186,Masclat,46,,,461860000A0734,,,,,,,,,,,,,0,1,Maison,126,5,S,sols,,,865,1.392273,44.833821
2020-683688,2020-12-28,000001,Vente,65000,5053,,LE BOURG,B007,46350,46186,Masclat,46,,,461860000A0734,,,,,,,,,,,,,0,4,Local industriel. commercial ou assimilé,75,0,S,sols,,,865,1.392273,44.833821
2020-683688,2020-12-28,000001,Vente,65000,,,LE BOURG,B007,46350,46186,Masclat,46,,,461860000A0735,,,,,,,,,,,,,0,,,,,S,sols,,,90,1.392091,44.833779
2020-683688,2020-12-28,000001,Vente,65000,,,LE BOURG,B007,46350,46186,Masclat,46,,,461860000A0735,,,,,,,,,,,,,0,,,,,J,jardins,POTAG,Jardin potager,437,1.392091,44.833779
